{"text_format":"1","workbook":"xlsx","n_sheets":4,"sheets":["Beef Repl","Prices and weights","Net present value","Sensitivity Table"],"not_rendered":{"charts":5,"images":3,"macros":1,"external_links":2,"defined_names":8,"comments":2,"pivot_tables":0},"unopened":[],"bounds":{"document_bytes":16777216,"sheet_cells":100000,"rows_first":2000,"rows_last":500,"rows_between":2000,"halvings":0,"cell_chars":16384,"cell_head_chars":4096},"cells_cut":0,"cells_raw":0,"read":"whole","date_system":"1900"}

{"sheet":"Beef Repl","index":0,"n_rows":49,"n_cols":12,"rows_kept":49,"cut":false,"hidden":false,"merged":[[46,15,46,16],[4,1,5,8],[4,13,5,23],[7,2,7,3],[7,4,7,5],[7,13,8,13],[28,1,29,11],[40,1,40,4],[40,7,40,11],[46,1,46,3],[46,6,46,8],[48,1,49,11],[30,1,30,4],[32,1,36,11]]}
[]
[]
[null,"KSU-Beef Replacements"]
[]
[null,"An Excel spreadsheet program to evaluate the economic value of purchasing beef replacement females."]
[]
[]
[null,null,null,null,null,null,null,null,null,null,null,"Version- 1.12.2016"]
[]
[]
[]
[]
[]
[]
[]
[]
[]
[]
[]
[]
{"$rows_left_out":30}
{"sheet":"Prices and weights","index":1,"n_rows":20,"n_cols":13,"rows_kept":20,"cut":false,"hidden":false,"merged":[[4,6,4,7],[1,1,1,7],[1,9,1,12],[4,2,4,3],[4,4,4,5]]}
[]
[null,"Calf (average of steer and heifer) and Cull Cow Price Scenarios ($/cwt)",null,null,null,null,null,null,null,"Weaning Weight (steer and heifer) Scenarios"]
[]
[null,null,"Scenario 1 (S1)",null,"Scenario 2 (S2)",null,"Scenario 3 (S3)",null,null,null,"Scenario1","Scenario2","Scenario3"]
[null,null,"USDA (As of Nov. '15)",null,"Flat at $25 under Scen 1",null,"Scenario 1 +10%",null,null,null,"Low peak","Constant","High peak"]
[null,"Year","Calf","Cull cow","Calf","Cull cow","Calf","Cull cow",null,"Calf","Lbs/hd","Lbs/hd","Lbs/hd"]
[null,{"$f":"'Net present value'!G5","v":2016},205,{"$f":"C7*0.44","v":90.2},{"$f":"C7-25","v":180},{"$f":"E7*0.44","v":79.2},{"$f":"C7*1.1","v":225.50000000000003},{"$f":"G7*0.44","v":99.220000000000013},null,1,542,562,537]
[null,{"$f":"B7+1","v":2017},169.56893725981922,{"$f":"C8*0.44","v":74.610332394320451},{"$f":"E7","v":180},{"$f":"E8*0.44","v":79.2},{"$f":"C8*1.1","v":186.52583098580115},{"$f":"G8*0.44","v":82.071365633752507},null,2,552,{"$f":"L7","v":562},552]
[null,{"$f":"B8+1","v":2018},158.20226671441031,69.608997354340545,{"$f":"E8","v":180},79.2,174.02249338585136,76.569897089774599,null,3,562,{"$f":"L8","v":562},567]
[null,2019,151.58755984477699,66.698526331701871,180,79.2,166.74631582925471,73.368378964872079,null,4,567,562,582]
[null,2020,144.81308624673179,63.717757948561989,180,79.2,159.29439487140499,70.089533743418201,null,5,572,562,582]
[null,2021,143.0534196178078,62.943504631835431,180,79.2,157.35876157958859,69.237855095018986,null,6,572,562,577]
[null,2022,140.24507849224455,61.707834536587598,180,79.2,154.26958634146902,67.878617990246369,null,7,567,562,567]
[null,2023,138.6668814307524,61.013427829531054,180,79.2,152.53356957382766,67.114770612484179,null,8,565,562,557]
[null,2024,139.44683790220549,61.356608676970417,180,79.2,153.39152169242604,67.492269544667451,null,9,562,562,552]
[null,2025,140.26,61.714399999999998,180,79.2,154.286,67.885840000000002,null,10,559,562,547]
[null,"Average",{"$f":"AVERAGE(C7:C16)","v":153.08440675087485},67.357138970384923,180,79.200000000000017,168.39284742596237,74.092852867423446,null,"Average",{"$f":"AVERAGE(K7:K16)","v":562},{"$f":"AVERAGE(L7:L16)","v":562},{"$f":"AVERAGE(M7:M16)","v":562}]
[]
[null,"Average weight for calf price (average of steer and heifer), lbs/head",null,null,null,null,null,525]
[null,"Price slide (change in price for weight deviation from base), $/lb",null,null,null,null,null,8.4199999999999997E-2]
{"$rows_left_out":1}
{"sheet":"Net present value","index":2,"n_rows":79,"n_cols":45,"rows_kept":79,"cut":false,"hidden":false,"merged":[[25,1,26,14],[11,8,11,9],[11,41,11,42]]}
[]
[null,"Input Assumptions"]
[null,"Number of replacements purchased",null,null,null,null,100,null,"Percent marketable calves (1 - death loss)",null,null,null,null,0.97]
[null,"Year of purchase",null,null,null,null,2016,null,"Annual cow death loss",null,null,null,null,5.0000000000000001E-3]
[null,"First year for calf sales",null,null,null,null,2016,null,"Annual cull rate",null,null,null,null,0.15]
[null,"Cull cow weight, lbs/hd",null,null,null,null,1250]
[null,"Annual cow costs, $/year",null,null,null,null,700,null,"Annual inflation rate on costs",null,null,null,null,0.01]
[null,{"$f":"\"Price scenario to use (1-3) (\"&IF(G8=1,'Prices and weights'!C5,IF(G8=2,'Prices and weights'!E5,'Prices and weights'!G5))&\")\"","v":"Price scenario to use (1-3) (USDA (As of Nov. '15))"},null,null,null,null,1,null,"Annual increase in average weaning weight",null,null,null,null,0,null,null,null,null,null,null,null,null,null,null,null,null,null,null,null,null,null,null,null,null,null,"Sensitivity to discount rate",null,null,"Sensitivity to calf/cull prices"]
[null,"Weaning weight scenario to use (1-3)",null,null,null,null,1,null,"Discount rate (interest rate)",null,null,null,null,7.4999999999999997E-2,null,null,null,"Values for sensitivity analysis down below",null,null,null,null,null,null,null,null,null,null,null,null,null,null,null,null,null,0.9,"<= % of base",null,1.1000000000000001,"<= % of base"]
[]
[null,"Net Present Value Analysis",null,null,null,null,null,null,null,null,null,null,null,null,null,null,null,"Annual cow costs, $/year",null,null,null,null,null,"Annual Cull Rate",null,null,null,null,null,"Annual Cull Rate",null,null,null,null,null,{"$f":"N9*AJ9","v":6.7500000000000004E-2}]
[null,null,"Cows at",null,null,"Prices, $/cwt",null,"Calf","Cull Income",null,null,"Cost","Net","Discount",null,null,null,{"$f":"D33","v":560},{"$f":"E33","v":630},{"$f":"F33","v":700},{"$f":"G33","v":770},{"$f":"H33","v":840},null,{"$f":"Y12-H72","v":0.1},{"$f":"Z12-H72","v":0.125},{"$f":"N5","v":0.15},{"$f":"Z12+H72","v":0.17499999999999999},{"$f":"AA12+H72","v":0.19999999999999998},null,{"$f":"X12","v":0.1},{"$f":"Y12","v":0.125},{"$f":"Z12","v":0.15},{"$f":"AA12","v":0.17499999999999999},{"$f":"AB12","v":0.19999999999999998},null,"Discount",null,null,"Prices, $/cwt",null,"Calf","Cull Income",null,"Net"]
[null,"Year","BOY*","Calf","Calf wt","Calf","Cull","Income","Annual","Age","Cost","Adj.","Income","factor","NPV**",null,null,"Cost","Cost","Cost","Cost","Cost",null,"Cows at Beginning of Year (BOY)",null,null,null,null,null,"Net Income",null,null,null,null,null,"factor","NPV**",null,"Calf","Cull","Income","Annual","Age","Income","NPV**"]
[null,{"$f":"G5","v":2016},{"$f":"G3","v":100},{"$f":"IF(G5=B14,1,0)","v":1},{"$f":"VLOOKUP(D14,weights,IF(G$9=1,2,IF(G$9=2,3,4)))*(1+N$8)^(B14-G$5)","v":542},{"$f":"VLOOKUP(B14,Prices,IF(G$8=1,2,IF(G$8=2,4,6)))+('Prices and weights'!H$19-E14)*'Prices and weights'!H$20","v":203.5686},{"$f":"VLOOKUP(B14,Prices,IF(G$8=1,3,IF(G$8=2,5,7)))","v":90.2},{"$f":"IF(B14>=G$5,E14*F14/100*N$3*C14/G$3,0)","v":1070.2415576400001},{"$f":"IF(B14>=G$5,G$6*G14/100*(N$5*C14/G$3),0)","v":169.125},{"$f":"IF(B14>=G$5,G$6*G14/100*(C14*(1-N$4-N$5))/G$3,0)","v":952.73749999999995},{"$f":"G$7*(1+N$7)^(B14-G$4)*C14/G$3","v":700},0,{"$f":"H14+I14-K14-L14","v":539.36655764000011},{"$f":"1/(1+N$9)^(B14-G$4)","v":1},{"$f":"SUMPRODUCT(M$14:M14,N$14:N14)+J14*N14","v":1492.1040576400001},null,null,{"$f":"D$33*(1+N$7)^(B14-G$4)*C14/G$3","v":560},{"$f":"E$33*(1+N$7)^(B14-G$4)*C14/G$3","v":630},{"$f":"F$33*(1+N$7)^(B14-G$4)*C14/G$3","v":700},{"$f":"G$33*(1+N$7)^(B14-G$4)*C14/G$3","v":770},{"$f":"H$33*(1+N$7)^(B14-G$4)*C14/G$3","v":840},null,{"$f":"$G3","v":100},{"$f":"$G3","v":100},{"$f":"$G3","v":100},{"$f":"$G3","v":100},{"$f":"$G3","v":100},null,{"$f":"IF(B14>=G$5,E14*F14/100*N$3*X14/G$3,0)+IF(B14>=G$5,G$6*G14/100*(AD$12*X14/G$3),0)-G$7*(1+N$7)^(B14-G$4)*X14/G$3-L14","v":482.99155764000011},{"$f":"IF(B14>=G$5,E14*F14/100*N$3*Y14/G$3,0)+IF(B14>=G$5,G$6*G14/100*(AE$12*Y14/G$3),0)-G$7*(1+N$7)^(B14-G$4)*Y14/G$3-L14","v":511.17905764000011},{"$f":"IF(B14>=G$5,E14*F14/100*N$3*Z14/G$3,0)+IF(B14>=G$5,G$6*G14/100*(AF$12*Z14/G$3),0)-G$7*(1+N$7)^(B14-G$4)*Z14/G$3-L14","v":539.36655764000011},{"$f":"IF(B14>=G$5,E14*F14/100*N$3*AA14/G$3,0)+IF(B14>=G$5,G$6*G14/100*(AG$12*AA14/G$3),0)-G$7*(1+N$7)^(B14-G$4)*AA14/G$3-L14","v":567.55405764000011},{"$f":"IF(B14>=G$5,E14*F14/100*N$3*AB14/G$3,0)+IF(B14>=G$5,G$6*G14/100*(AH$12*AB14/G$3),0)-G$7*(1+N$7)^(B14-G$4)*AB14/G$3-L14","v":595.74155764000011},null,{"$f":"1/(1+AJ$11)^(B14-G$4)","v":1},{"$f":"SUMPRODUCT(M$14:M14,AJ$14:AJ14)+J14*AJ14","v":1492.1040576400001},null,{"$f":"VLOOKUP(B14,Prices,IF(G$8=1,2,IF(G$8=2,4,6)))*AM$9+('Prices and weights'!H$19-E14)*'Prices and weights'!H$20","v":224.06860000000003},{"$f":"G14*AM$9","v":99.220000000000013},{"$f":"IF(B14>=G$5,E14*AM14/100*N$3*C14/G$3,0)","v":1178.0182576400002},{"$f":"IF(B14>=G$5,G$6*AN14/100*(N$5*C14/G$3),0)","v":186.03750000000002},{"$f":"IF(B14>=G$5,G$6*AN14/100*(C14*(1-N$4-N$5))/G$3,0)","v":1048.0112500000002},{"$f":"AO14+AP14-K14-L14","v":664.05575764000014},{"$f":"SUMPRODUCT(AR$14:AR14,N$14:N14)+AQ14*N14","v":1712.0670076400004}]
[null,{"$f":"+B14+1","v":2017},{"$f":"C14*(1-N$4-N$5)","v":84.5},{"$f":"IF(D14>0,D14+1,IF(G$5=B15,1,0))","v":2},552,{"$f":"VLOOKUP(B15,Prices,IF(G$8=1,2,IF(G$8=2,4,6)))+('Prices and weights'!H$19-E15)*'Prices and weights'!H$20","v":167.29553725981921},{"$f":"VLOOKUP(B15,Prices,IF(G$8=1,3,IF(G$8=2,5,7)))","v":74.610332394320451},{"$f":"IF(B15>=G$5,E15*F15/100*N$3*C15/G$3,0)","v":756.9233048748597},{"$f":"G$6*G15/100*(N$5*C15/G$3)","v":118.21074538725146},{"$f":"IF(B15>=G$5,G$6*G15/100*(C15*(1-N$4-N$5))/G$3,0)","v":665.92053234818331},{"$f":"G$7*(1+N$7)^(B15-G$4)*C15/G$3","v":597.41499999999996},0,{"$f":"H15+I15-K15-L15","v":277.71905026211118},0.93023255813953487,{"$f":"SUMPRODUCT(M$14:M15,N$14:N15)+J15*N15","v":1417.1708205332973},null,null,477.93200000000002,537.67349999999999,597.41499999999996,657.15650000000005,716.89800000000002,null,{"$f":"X14*(1-$N$4-X$12)","v":89.5},{"$f":"Y14*(1-$N$4-Y$12)","v":87},{"$f":"Z14*(1-$N$4-Z$12)","v":84.5},{"$f":"AA14*(1-$N$4-AA$12)","v":82},{"$f":"AB14*(1-$N$4-AB$12)","v":79.5},null,252.41697547620458,265.65090609098843,277.71905026211118,288.62140798957262,298.35797927337273,null,0.93676814988290402,{"$f":"SUMPRODUCT(M$14:M15,AJ$14:AJ15)+J15*AJ15","v":1423.3380635981214},null,{"$f":"VLOOKUP(B15,Prices,IF(G$8=1,2,IF(G$8=2,4,6)))*AM$9+('Prices and weights'!H$19-E15)*'Prices and weights'!H$20","v":184.25243098580114},82.071365633752507,833.64422791746563,130.03181992597663,732.51258558300162,366.26104784344227,{"$f":"SUMPRODUCT(AR$14:AR15,N$14:N15)+AQ15*N15","v":1686.1707654785528}]
[null,2018,71.402500000000003,{"$f":"IF(D15>0,D15+1,IF(G$5=B16,1,0))","v":3},562,{"$f":"VLOOKUP(B16,Prices,IF(G$8=1,2,IF(G$8=2,4,6)))+('Prices and weights'!H$19-E16)*'Prices and weights'!H$20","v":155.08686671441032},69.608997354340545,603.66568529138283,{"$f":"G$6*G16/100*(N$5*C16/G$3)","v":93.192308129874405},524.98333579829239,509.86383175000003,0,186.99416167125719,0.86533261222282321,{"$f":"SUMPRODUCT(M$14:M16,N$14:N16)+J16*N16","v":1413.8072079385997},null,null,407.8910654,458.87744857500002,509.86383175000003,560.85021492500005,611.83659810000006,null,{"$f":"X15*(1-$N$4-X$12)","v":80.102500000000006},75.69,71.402500000000003,67.240000000000009,63.202500000000001,null,174.92927485658709,181.75788144447438,186.99416167125719,190.71968858070971,193.01603521660661,null,0.87753456663503904,{"$f":"SUMPRODUCT(M$14:M16,AJ$14:AJ16)+J16*AJ16","v":1424.3097832371159},null,{"$f":"VLOOKUP(B16,Prices,IF(G$8=1,2,IF(G$8=2,4,6)))*AM$9+('Prices and weights'!H$19-E16)*'Prices and weights'!H$20","v":170.90709338585137},76.569897089774599,665.244903296134,102.51153894286185,577.48166937812164,257.89261048899584,{"$f":"SUMPRODUCT(AR$14:AR16,N$14:N16)+AQ16*N16","v":1727.6403169034447}]
[null,2019,60.335112500000001,4,567,{"$f":"VLOOKUP(B17,Prices,IF(G$8=1,2,IF(G$8=2,4,6)))+('Prices and weights'!H$19-E17)*'Prices and weights'!H$20","v":148.051159844777},66.698526331701871,491.28865349107059,75.454932933889594,425.06278886091138,435.14328720703747,0,131.60029921792272,0.80496056950960304,{"$f":"SUMPRODUCT(M$14:M17,N$14:N17)+J17*N17","v":1407.6138430037245},null,null,348.11462976562996,391.62895848633372,435.14328720703747,478.65761592774123,522.17194464844499,null,71.691737500000002,65.850300000000004,60.335112500000001,55.136800000000015,50.245987500000005,null,126.48503845574055,129.90441547438718,131.60029921792272,131.75429098520885,130.54017584155258,null,0.82204643244500153,{"$f":"SUMPRODUCT(M$14:M17,AJ$14:AJ17)+J17*AJ17","v":1421.2216647957673},null,{"$f":"VLOOKUP(B17,Prices,IF(G$8=1,2,IF(G$8=2,4,6)))*AM$9+('Prices and weights'!H$19-E17)*'Prices and weights'!H$20","v":163.20991582925473},73.368378964872065,541.59102750841612,83.000426227278552,467.56906774700258,189.44816652865723,{"$f":"SUMPRODUCT(AR$14:AR17,N$14:N17)+AQ17*N17","v":1756.7995625098374}]
[null,2020,50.983170062500001,5,572,{"$f":"VLOOKUP(B18,Prices,IF(G$8=1,2,IF(G$8=2,4,6)))+('Prices and weights'!H$19-E18)*'Prices and weights'!H$20","v":140.85568624673178},63.717757948561989,398.44555173289439,60.909999177989008,343.12632870267146,371.3730384668462,0,87.982512444037184,0.7488005297763749,{"$f":"SUMPRODUCT(M$14:M18,N$14:N18)+J18*N18","v":1388.2695870468397},null,null,297.09843077347693,334.23573462016151,371.3730384668462,408.51034231353077,445.64764616021546,null,64.164105062499999,57.289761000000006,50.983170062500001,45.212176000000014,39.945560062500007,null,85.17661752418735,87.458480031666625,87.982512444037184,87.025968882189886,84.842483120815757,null,0.77006691563934571,{"$f":"SUMPRODUCT(M$14:M18,AJ$14:AJ18)+J18*AJ18","v":1403.7829712542309},null,{"$f":"VLOOKUP(B18,Prices,IF(G$8=1,2,IF(G$8=2,4,6)))*AM$9+('Prices and weights'!H$19-E18)*'Prices and weights'!H$20","v":155.33699487140498},70.089533743418187,439.409556513398,67.000999095787904,377.43896157293852,135.03751714233971,{"$f":"SUMPRODUCT(AR$14:AR18,N$14:N18)+AQ18*N18","v":1764.1675582110674}]
[null,2021,43.080778702812502,6,572,{"$f":"VLOOKUP(B19,Prices,IF(G$8=1,2,IF(G$8=2,4,6)))+('Prices and weights'!H$19-E19)*'Prices and weights'!H$20","v":139.0960196178078},62.943504631835431,332.48037076019131,50.843534884191669,286.4185798476131,316.94831967952985,0,66.375585964853144,0.69655863235011617,{"$f":"SUMPRODUCT(M$14:M19,N$14:N19)+J19*N19","v":1377.0782319734883},null,null,253.55865574362386,285.25348771157689,316.94831967952985,348.6431516474828,380.3379836154358,null,57.426874030937498,49.842092070000007,43.080778702812502,37.073984320000015,31.756720249687508,null,65.887403656748631,66.989040803827947,66.375585964853144,64.413169539317778,61.421333732678022,null,0.72137415984950426,{"$f":"SUMPRODUCT(M$14:M19,AJ$14:AJ19)+J19*AJ19","v":1394.049332598287},null,{"$f":"VLOOKUP(B19,Prices,IF(G$8=1,2,IF(G$8=2,4,6)))*AM$9+('Prices and weights'!H$19-E19)*'Prices and weights'!H$20","v":153.40136157958858},69.237855095018986,366.67434275430634,55.927888372610845,315.06043783237448,105.65391144738732,{"$f":"SUMPRODUCT(AR$14:AR19,N$14:N19)+AQ19*N19","v":1774.5932755713864}]
[null,2022,36.403258003876566,7,567,{"$f":"VLOOKUP(B20,Prices,IF(G$8=1,2,IF(G$8=2,4,6)))+('Prices and weights'!H$19-E20)*'Prices and weights'!H$20","v":136.70867849224456},61.707834536587598,273.71029455742593,42.119366653048566,237.27243214550685,270.49954343049484,0,45.330117779979673,0.64796151846522443,{"$f":"SUMPRODUCT(M$14:M20,N$14:N20)+J20*N20","v":1360.686475087035},null,null,216.39963474439585,243.44958908744536,270.49954343049484,297.54949777354432,324.5994521165938,null,51.397052257689062,43.362620100900003,36.403258003876566,30.400667142400014,25.246592598501572,null,44.178207050526112,45.634147921621832,45.330117779979673,43.717935803900133,41.174552178977137,null,0.67576033709555439,{"$f":"SUMPRODUCT(M$14:M20,AJ$14:AJ20)+J20*AJ20","v":1378.405964597137},null,{"$f":"VLOOKUP(B20,Prices,IF(G$8=1,2,IF(G$8=2,4,6)))*AM$9+('Prices and weights'!H$19-E20)*'Prices and weights'!H$20","v":150.73318634146904},67.878617990246369,301.78936178834738,46.331303318353427,260.99967536005761,77.621121676205973,{"$f":"SUMPRODUCT(AR$14:AR20,N$14:N20)+AQ20*N20","v":1774.5484537187606}]
{"$rows_left_out":60}
{"sheet":"Sensitivity Table","index":3,"n_rows":35,"n_cols":14,"rows_kept":35,"cut":false,"hidden":false,"merged":[[4,1,4,6],[34,1,35,6],[31,1,32,6]]}
[]
[null,"Sensitivity of results in \"Net present value\" tab"]
[null,"Range NPV values are pulled from",null,"O14:O23","E35:E44","AK14:AK23","AS14:AS23"]
[]
[null,"Table 1. Net Present Value of Beef Replacements, Sensitivity Analysis Summary*",null,null,null,null,null,null,"Marginal Impacts (relative to Base Case):"]
[null,null,"Number",null,"10% Lower","10% Lower","10% Higher",null,"Costs","Discount","Prices","Costs","Discount","Prices"]
[null,"Year","of Calves","Base Case","Cow Costs/yr","Discount Rate","Calf Prices",null,"$/head","$/head","$/head","%","%","%"]
[null,{"$f":"'Net present value'!B14","v":2016},{"$f":"'Net present value'!D14","v":1},{"$f":"'Net present value'!O14","v":1492.1040576400001},{"$f":"'Net present value'!E35","v":1562.1040576400001},{"$f":"'Net present value'!AK14","v":1492.1040576400001},{"$f":"'Net present value'!AS14","v":1712.0670076400004},null,{"$f":"E8-$D8","v":70},{"$f":"F8-$D8","v":0},{"$f":"G8-$D8","v":219.96295000000032},{"$f":"I8/$D8","v":4.6913618149873632E-2},{"$f":"J8/$D8","v":0},{"$f":"K8/$D8","v":0.14741796919171088}]
[null,{"$f":"'Net present value'!B15","v":2017},{"$f":"'Net present value'!D15","v":2},{"$f":"'Net present value'!O15","v":1417.1708205332973},{"$f":"'Net present value'!E36","v":1542.74430890539},{"$f":"'Net present value'!AK15","v":1423.3380635981214},{"$f":"'Net present value'!AS15","v":1686.1707654785528},null,125.5734883720927,6.1672430648241061,268.99994494525549,8.8608576011209417E-2,4.351799356483577E-3,0.18981476406918102]
[null,{"$f":"'Net present value'!B16","v":2018},{"$f":"'Net present value'!D16","v":3},{"$f":"'Net present value'!O16","v":1413.8072079385997},{"$f":"'Net present value'!E37","v":1583.5008764513091},{"$f":"'Net present value'!AK16","v":1424.3097832371159},{"$f":"'Net present value'!AS16","v":1727.6403169034447},null,169.69366851270934,10.502575298516149,313.833108964845,0.12002603152669665,7.4285767108440608E-3,0.22197730157454004]
[null,{"$f":"'Net present value'!B17","v":2019},{"$f":"'Net present value'!D17","v":4},{"$f":"'Net present value'!O17","v":1407.6138430037245},{"$f":"'Net present value'!E38","v":1612.3348303452797},{"$f":"'Net present value'!AK17","v":1421.2216647957673},{"$f":"'Net present value'!AS17","v":1756.7995625098374},null,204.7209873415552,13.607821792042841,349.18571950611295,0.14543831631031603,9.6672975046941442E-3,0.24806925652349457]
[null,{"$f":"'Net present value'!B18","v":2020},{"$f":"'Net present value'!D18","v":5},{"$f":"'Net present value'!O18","v":1388.2695870468397},{"$f":"'Net present value'!E39","v":1620.7990071832587},{"$f":"'Net present value'!AK18","v":1403.7829712542309},{"$f":"'Net present value'!AS18","v":1764.1675582110674},null,232.52942013641905,15.513384207391255,375.89797116422778,0.16749586845812939,1.1174619362217461E-2,0.27076727364160369]
[null,{"$f":"'Net present value'!B19","v":2021},{"$f":"'Net present value'!D19","v":6},{"$f":"'Net present value'!O19","v":1377.0782319734883},{"$f":"'Net present value'!E40","v":1631.6849609180717},{"$f":"'Net present value'!AK19","v":1394.049332598287},{"$f":"'Net present value'!AS19","v":1774.5932755713864},null,254.60672894458344,16.971100624798737,397.51504359789806,0.18488908112337743,1.2323991644597769E-2,0.28866554881796364]
[null,{"$f":"'Net present value'!B20","v":2022},{"$f":"'Net present value'!D20","v":7},{"$f":"'Net present value'!O20","v":1360.686475087035},{"$f":"'Net present value'!E41","v":1632.8205335221555},{"$f":"'Net present value'!AK20","v":1378.405964597137},{"$f":"'Net present value'!AS20","v":1774.5484537187606},null,272.13405843512055,17.719489510101994,413.86197863172561,0.19999762136072805,1.3022463171737327E-2,0.30415675191101854]
[null,{"$f":"'Net present value'!B21","v":2023},{"$f":"'Net present value'!D21","v":8},{"$f":"'Net present value'!O21","v":1345.9770510625833},{"$f":"'Net present value'!E42","v":1632.0261786639353},{"$f":"'Net present value'!AK21","v":1364.0842044768451},{"$f":"'Net present value'!AS21","v":1772.625395835998},null,286.04912760135198,18.107153414261802,426.64834477341469,0.21252154884478167,1.3452795053204724E-2,0.31698040054739168]
[null,{"$f":"'Net present value'!B22","v":2024},{"$f":"'Net present value'!D22","v":9},{"$f":"'Net present value'!O22","v":1335.5495297789348},{"$f":"'Net present value'!E43","v":1632.6459278732364},{"$f":"'Net present value'!AK22","v":1353.937649167337},{"$f":"'Net present value'!AS22","v":1772.4499115072763},null,297.09639809430155,18.388119388402174,436.90038172834147,0.22245254965832534,1.376820475646893E-2,0.32713154547002005]
[null,{"$f":"'Net present value'!B23","v":2025},{"$f":"'Net present value'!D23","v":10},{"$f":"'Net present value'!O23","v":1326.6736906513556},{"$f":"'Net present value'!E44","v":1632.5405938639901},{"$f":"'Net present value'!AK23","v":1345.1863707669509},{"$f":"'Net present value'!AS23","v":1771.6348251103407},null,305.8669032126345,18.512680115595231,444.96113445898504,0.23055172147301975,1.3954207614161761E-2,0.33539606430313917]
[]
[null,"Key Inputs Varied Across Scenarios**:"]
[null,"Annual cow costs, $/year",null,{"$f":"'Net present value'!G7","v":700},{"$f":"'Net present value'!E33","v":630},{"$f":"D20","v":700},{"$f":"D20","v":700}]
{"$rows_left_out":15}