{"text_format":"1","workbook":"xlsx","n_sheets":6,"sheets":["Instructions","Inputs","Results","Fields","Notes","Ammortization"],"not_rendered":{"charts":12,"images":6,"macros":1,"external_links":3,"defined_names":18,"comments":4,"pivot_tables":0},"unopened":[],"bounds":{"document_bytes":16777216,"sheet_cells":100000,"rows_first":2000,"rows_last":500,"rows_between":2000,"halvings":0,"cell_chars":16384,"cell_head_chars":4096},"cells_cut":0,"cells_raw":0,"read":"whole","date_system":"1900"}

{"sheet":"Instructions","index":0,"n_rows":58,"n_cols":11,"rows_kept":58,"cut":false,"hidden":false,"merged":[[29,1,35,10],[4,1,5,8],[4,12,5,22],[7,2,7,3],[7,4,7,5],[7,12,8,12],[36,1,36,4],[38,1,38,10],[39,1,39,10],[40,1,40,10],[43,1,44,10],[49,10,49,11],[49,1,49,3],[49,4,49,5],[49,7,49,8],[55,1,55,5],[55,6,55,8]]}
[]
[]
[null,"KSU-Guidance & Section Control Profit Calculator"]
[]
[null,"A computer spreadsheet program to analyze the economics of investing in machine guidance and section control technologies."]
[]
[]
[null,null,null,null,null,null,null,null,null,null,"Version- 5.20.2016"]
[]
[]
[]
[]
[]
[]
[]
[]
[]
[]
[]
[]
[]
[]
[]
[]
[null,"How the Calculator Works:"]
[null,"This spreadsheet examines:"]
[null,"1) economics of guidance systems in the context of overlap, which impacts machine and crop input usage per land acre"]
[null,"2) economics of boom/machine section control, which impacts crop input usage and reduced yield on headlands"]
[]
[null,"Typical uses would involve crop spraying, planting, tillage, etc. Dollar-valued calculations generally are on a per \"applied\" acre basis. A farm with 3,000 acres that sprays each acre three times a year would have 9,000 applied acres. Per-applied acre benefits are used along with user-entered information on total acres of use, total investment, ammortization years, and interest rate to calculate three results: (a) net benefits per acre (no salvage value of technology is considered). (b) years for payback, and (c) return on investment (ROI). Each of these three individual measures is calculated, holding the other two at user-entered values. If you use the same technology for different machine operation, you need to allocate the investment across the different machines."]
[]
[]
[]
[]
[]
[]
[null,"INSTRUCTIONS FOR THE USER:"]
[null,"Be sure to \"Enable Content\" and \"Enable Macros\" for the spreadsheet to function correctly."]
[null,"The user inputs information for a field of interest (or an average for their farm).  Users can enter individual field information (size and shape) in the Fields tab to determine an average for their entire farm.  Even if individual field information is entered in the Fields tab, the user must still enter values for a typical or average field in the Inputs tab."]
[null,"In the Inputs and Fields tabs, blue shaded numbers are inputs and all other numbers are calculated from these inputs.  The spreadsheet automatically recalculates every time an additional input is entered.  Thus, it is important to wait until all data have been entered and reviewed before interpreting any of the calculated results (i.e., black numbers)."]
[null,"Several of the input cells and calculated values have a red diamond in the upper right hand corner of the cell (if the comments do not appear go to View / Comments on the Excel menu -- you may need to click and then again).  By moving your mouse cursor over this diamond, a brief description of the input will be displayed on the screen.  "]
[]
[null,"FOR MORE INFORMATION:"]
[null,"For additional assistance in using this spreadsheet, please download the written tutorial and/or watch the instruction video available through the link below:"]
[]
[]
[]
[]
[null,"Developers:"]
[null,"Kevin C. Dhuyvetter",null,null,"Craig M. Smith",null,null,"Terry L. Kastens",null,null,"Dietrich L. Kastens"]
[null,"Former Agricultural Economist",null,null,"Associate Professor",null,null,"Professor Emeritus",null,null,"Geographer"]
[null,"Kansas State University",null,null,"Fort Hays State Univ.",null,null,"Kansas State Univ.",null,null,"Kastens Inc."]
[null,null,null,null,"cmsmith11@fhsu.edu",null,null,"terrykastens@gmail.com",null,null,"dietrich@kastensinc.com"]
[]
[null,"ACKNOWLEDGEMENTS:"]
[null,"This project was sponsored by PrecisionAg Institute ",null,null,null,null,"www.precisionagworks.com"]
[]
[null,"Copyright 2016 AgManager.info, K-State Department of Agricultural Economics"]

{"sheet":"Inputs","index":1,"n_rows":447,"n_cols":9,"rows_kept":447,"cut":false,"hidden":false,"merged":[[185,1,185,8],[139,1,139,8],[149,3,149,8],[142,3,142,8],[156,3,156,8]]}
[]
[null,"Economic Analysis of Guidance Systems and Section Controls"]
[]
[null,"Section A:  Whole-farm information -- INPUTS"]
[null,"Size of typical field",null,null,null,"acres",80]
[null,"Maximum width of field, perpendicular to direction of swaths (passes)",null,null,null,"feet",2000]
[null,"Running distance of headlands to cover for field",null,null,null,"feet",6000]
[null,"Calculated average angle of approach to headland in degrees (0-90)",null,null,null,{"$f":"Inputs!C372","v":"degrees"},{"$f":"IF(ISNUMBER(DEGREES(ASIN(2*G6/G7))),DEGREES(ASIN(2*G6/G7)),\"n/a\")","v":41.810314895778596}]
[null,"Interest rate for investment analysis, percent",null,null,null,"interest",0.06]
[null,"Number of years for amortization",null,null,null,"years",5]
[null,"Annual non-ownership costs for current technology (e.g., subscriptions, fees, support)",null,null,null,"$/farm",0]
[null,"Annual non-ownership costs for new technology (e.g., subscriptions, fees, support)",null,null,null,"$/farm",3000]
[]
[null,"Cost and income categories to include in net benefits total"]
[null,"   Machine costs",null,null,null,null,1]
[null,"   Input costs",null,null,null,null,1]
[null,"   Yield revenue",null,null,null,null,1]
[null,"   Non-ownership costs",null,null,null,null,0]
[]
[null,"Section B:  Equipment-specific information -- INPUTS",null,null,null,null,null,null,"Farm"]
[null,"Implement/farming operation",null,"Sprayer","Planter","Fertilizer","Other 1","Other 2","Total/Avg"]
[null,"Include in whole-farm analysis (1=Yes, 0=No)",null,1,1,1,0,0]
[null,"Number of swaths (passes) needed to cover headlands","count",2,1,2,2,2,{"$f":"(SUMPRODUCT(D23:H23,$D$36:$H$36,$D$22:$H$22))/$I$36","v":1.8}]
[null,"Width of machine","feet",90,40,48,60,90,63.2]
[null,"Turnaround speed is this portion of field speed","percent",0.67,0.75,0.67,0.5,0.5,0.68600000000000005]
[null,{"$f":"Inputs!B367","v":"Area in headlands"},{"$f":"Inputs!C367","v":"acres"},{"$f":"D367","v":24.266528925619834},{"$f":"E367","v":5.5096418732782366},{"$f":"F367","v":13.041322314049587},{"$f":"G367","v":16.15702479338843},{"$f":"H367","v":24.266528925619834},16.025068870523416]
[null,"Number of machine or boom sections to be controlled","count",5,8,4,5,5,5.2]
[null,"Reaction distance (overlap) on manual shutoff of boom","feet",15,10,15,15,15,14]
[]
[null,"Custom rate of machine operation, $/ application acre",null,5,15,7.5,6,6,{"$f":"(SUMPRODUCT(D30:H30,$D$36:$H$36,$D$22:$H$22))/$I$36","v":8}]
[null,"Cost of input (fertilizer, herbicide, etc.), $/application acre",null,15,60,35,15,15,{"$f":"(SUMPRODUCT(D31:H31,$D$36:$H$36,$D$22:$H$22))/$I$36","v":32}]
[null,"Lost yield revenue for doubling up, $/doubled-up acre",null,0,50,0,0,0,{"$f":"(SUMPRODUCT(D32:H32,$D$36:$H$36,$D$22:$H$22))/$I$36","v":10}]
[null,"Current overlap to consider","percent",7.0000000000000007E-2,0.02,0.04,7.0000000000000007E-2,7.0000000000000007E-2,{"$f":"(SUMPRODUCT(D33:H33,$D$36:$H$36,$D$22:$H$22))/$I$36","v":4.8000000000000001E-2}]
[null,"Expected overlap to consider","percent",1.4999999999999999E-2,0,1.4999999999999999E-2,0.02,1.4999999999999999E-2,{"$f":"(SUMPRODUCT(D34:H34,$D$36:$H$36,$D$22:$H$22))/$I$36","v":1.2E-2}]
[]
[null,"Total acres of use annually","acres",10000,5000,10000,7500,10000,{"$f":"SUMPRODUCT(D36:H36,$D$22:$H$22)","v":25000}]
[null,"Expected autoguidance investment"]
[null,"autoguidance","dollars",15000,7500,7500,5000,15000,{"$f":"SUMPRODUCT(D38:H38,$D$22:$H$22)","v":30000}]
[null,"boom section/control","dollars",10000,20000,10000,10000,10000,{"$f":"SUMPRODUCT(D39:H39,$D$22:$H$22)","v":40000}]
[null,"autoguidance, $/acre",null,{"$f":"IF(D36=0,\"n/a\",D38/D36)","v":1.5},{"$f":"IF(E36=0,\"n/a\",E38/E36)","v":1.5},{"$f":"IF(F36=0,\"n/a\",F38/F36)","v":0.75},{"$f":"IF(G36=0,\"n/a\",G38/G36)","v":0.66666666666666663},{"$f":"IF(H36=0,\"n/a\",H38/H36)","v":1.5},{"$f":"I38/I36","v":1.2}]
[null,"boom/section control, $/acre",null,{"$f":"IF(D36=0,\"n/a\",D39/D36)","v":1},{"$f":"IF(E36=0,\"n/a\",E39/E36)","v":4},{"$f":"IF(F36=0,\"n/a\",F39/F36)","v":1},{"$f":"IF(G36=0,\"n/a\",G39/G36)","v":1.3333333333333333},{"$f":"IF(H36=0,\"n/a\",H39/H36)","v":1},{"$f":"I39/I36","v":1.6}]
[]
[]
[]
[]
[]
[]
[]
[]
[]
[]
[]
[]
[]
[]
[]
[]
[]
[]
[]
[]
[]
[]
[]
[]
[]
[]
[]
[]
[]
[]
[]
[]
[]
[]
[]
[]
[]
[]
[]
[]
[]
[]
[]
[]
[]
[]
[]
[]
[]
[]
[]
[]
[]
[]
[]
[]
[]
[]
[]
[]
[]
[]
[]
[]
[]
[]
[]
[]
[]
[]
[]
[]
[]
[]
[]
[]
[]
[]
[]
{"$rows_left_out":328}
{"sheet":"Results","index":2,"n_rows":623,"n_cols":11,"rows_kept":623,"cut":false,"hidden":false,"merged":[[621,1,621,5],[622,1,622,5],[615,1,615,5],[618,1,618,5],[619,1,619,5],[620,1,620,5],[614,1,614,5],[497,1,497,5],[498,1,498,5],[499,1,499,5],[500,1,500,5],[607,1,607,10],[612,1,612,5],[613,1,613,5],[501,1,501,5],[492,1,492,5],[493,1,493,5],[494,1,494,5],[377,1,377,5],[378,1,378,5],[379,1,379,5],[380,1,380,5],[486,1,486,10],[376,1,376,5],[257,1,257,5],[258,1,258,5],[259,1,259,5],[491,1,491,5],[131,1,131,5],[251,1,251,5],[371,1,371,5],[372,1,372,5],[373,1,373,5],[370,1,370,5],[365,1,365,10],[135,1,135,5],[136,1,136,5],[252,1,252,5],[255,1,255,5],[256,1,256,5],[137,1,137,5],[138,1,138,5],[250,1,250,5],[244,1,244,10],[134,1,134,5],[249,1,249,5],[1,1,1,10],[123,1,123,10],[6,1,6,5],[7,1,7,5],[8,1,8,5],[9,1,9,5],[16,1,16,5],[12,1,12,5],[13,1,13,5],[14,1,14,5],[15,1,15,5],[128,1,128,5],[129,1,129,5],[130,1,130,5]]}
[]
[null,{"$f":"\"Analysis of Precision Ag Technologies for \"& Inputs!D21&\" vs. Applied Acres\"","v":"Analysis of Precision Ag Technologies for Sprayer vs. Applied Acres"}]
[]
[null,{"$f":"\"Acres applied annually (average field size = \"&Inputs!$G$5&\" acres)\"","v":"Acres applied annually (average field size = 80 acres)"},null,null,null,null,{"$f":"I4*Inputs!C$390","v":8000},{"$f":"I4*Inputs!C$391","v":9000},{"$f":"Inputs!$D$36","v":10000},{"$f":"I4*Inputs!C$393","v":11000},{"$f":"I4*Inputs!C$394","v":12000}]
[]
[null,{"$f":"\"Guidance system (going from \"&FIXED(Inputs!$D$33*100,2)&\"% to \"&FIXED(Inputs!$D$34*100,2)&\"% overlap)\"","v":"Guidance system (going from 7.00% to 1.50% overlap)"}]
[null,{"$f":"Inputs!$D$143","v":"Sum of net annual benefits, $/applied acre"},null,null,null,null,{"$f":"I7","v":0.96595469873769257},{"$f":"I7","v":0.96595469873769257},{"$f":"Inputs!D148","v":0.96595469873769257},{"$f":"I7","v":0.96595469873769257},{"$f":"I7","v":0.96595469873769257}]
[null,"Payback for given investment, years",null,null,null,null,{"$f":"Inputs!D403","v":2.1250522381000581},{"$f":"Inputs!D404","v":1.8755172294625371},{"$f":"Inputs!D405","v":1.6784690963950202},{"$f":"Inputs!D406","v":1.5189139221392942},{"$f":"Inputs!D407","v":1.3870751484404436}]
[null,"Sum of annual net benefits including cost of investment, $/applied acre",null,null,null,null,{"$f":"Inputs!D416","v":0.52083644792921202},{"$f":"Inputs!D417","v":0.57029403135237655},{"$f":"Inputs!D418","v":0.60986009809090813},{"$f":"Inputs!D419","v":0.64223233451334316},{"$f":"Inputs!D420","v":0.66920919819870561}]
[null,"ROI given benefits, years, and investment, %",null,null,null,null,{"$f":"IF(Inputs!$D$390=0,\"n/a\",RATE(Inputs!$G$10,Inputs!$D$148,Inputs!$D$390,0,0,Inputs!$D$148/-Inputs!$D$390))","v":0.42859841324151743},{"$f":"IF(Inputs!$D$391=0,\"n/a\",RATE(Inputs!$G$10,Inputs!$D$148,Inputs!$D$391,0,0,Inputs!$D$148/-Inputs!$D$391))","v":0.50434677776745018},{"$f":"IF(Inputs!$D$392=0,\"n/a\",RATE(Inputs!$G$10,Inputs!$D$148,Inputs!$D$392,0,0,Inputs!$D$148/-Inputs!$D$392))","v":0.57819449222461794},{"$f":"IF(Inputs!$D$393=0,\"n/a\",RATE(Inputs!$G$10,Inputs!$D$148,Inputs!$D$393,0,0,Inputs!$D$148/-Inputs!$D$393))","v":0.65054017530931008},{"$f":"IF(Inputs!$D$394=0,\"n/a\",RATE(Inputs!$G$10,Inputs!$D$148,Inputs!$D$394,0,0,Inputs!$D$148/-Inputs!$D$394))","v":0.72167976151913282}]
[]
[null,{"$f":"\"Section control (controlling \"&Inputs!$D$24&\"' implement in \"&Inputs!$D$27&\" sections)\"","v":"Section control (controlling 90' implement in 5 sections)"}]
[null,{"$f":"Inputs!$D$143","v":"Sum of net annual benefits, $/applied acre"},null,null,null,null,{"$f":"I13","v":0.99348379825425281},{"$f":"I13","v":0.99348379825425281},{"$f":"Inputs!D191","v":0.99348379825425281},{"$f":"I13","v":0.99348379825425281},{"$f":"I13","v":0.99348379825425281}]
[null,"Payback for given investment, years",null,null,null,null,{"$f":"Inputs!D409","v":1.3470904379949666},{"$f":"Inputs!D410","v":1.1920847549187168},{"$f":"Inputs!D411","v":1.0690803929795702},{"$f":"Inputs!D412","v":0.96909210298205295},{"$f":"Inputs!D413","v":0.88621124156547426}]
[null,"Sum of annual net benefits including cost of investment, $/applied acre",null,null,null,null,{"$f":"Inputs!D422","v":0.69673829771526585},{"$f":"Inputs!D423","v":0.72971001999737539},{"$f":"Inputs!D424","v":0.75608739782306322},{"$f":"Inputs!D425","v":0.77766888877135321},{"$f":"Inputs!D426","v":0.7956534645615948}]
[null,"ROI given benefits, years, and investment, %",null,null,null,null,{"$f":"IF(Inputs!$D$396=0,\"n/a\",RATE(Inputs!$G$10,Inputs!$D$191,Inputs!$D$396,0,0,Inputs!$D$191/-Inputs!$D$396))","v":0.74577412574902346},{"$f":"IF(Inputs!$D$397=0,\"n/a\",RATE(Inputs!$G$10,Inputs!$D$191,Inputs!$D$397,0,0,Inputs!$D$191/-Inputs!$D$397))","v":0.85323255680295951},{"$f":"IF(Inputs!$D$398=0,\"n/a\",RATE(Inputs!$G$10,Inputs!$D$191,Inputs!$D$398,0,0,Inputs!$D$191/-Inputs!$D$398))","v":0.95905449757211747},{"$f":"IF(Inputs!$D$399=0,\"n/a\",RATE(Inputs!$G$10,Inputs!$D$191,Inputs!$D$399,0,0,Inputs!$D$191/-Inputs!$D$399))","v":1.0636315148096092},{"$f":"IF(Inputs!$D$400=0,\"n/a\",RATE(Inputs!$G$10,Inputs!$D$191,Inputs!$D$400,0,0,Inputs!$D$191/-Inputs!$D$400))","v":1.1672460418989608}]
[null,"Guidance system and Section control ROI, %",null,null,null,null,{"$f":"IF(Inputs!$D$390+Inputs!$D$396=0,\"n/a/\",RATE(Inputs!$G$10,(Inputs!$D$148+Inputs!$D$191),(Inputs!$D$390+Inputs!$D$396),0,0,(Inputs!$D$148+Inputs!$D$191)/-(Inputs!$D$390+Inputs!$D$396)))","v":0.55891732674641825},{"$f":"IF(Inputs!$D$391+Inputs!$D$397=0,\"n/a/\",RATE(Inputs!$G$10,(Inputs!$D$148+Inputs!$D$191),(Inputs!$D$391+Inputs!$D$397),0,0,(Inputs!$D$148+Inputs!$D$191)/-(Inputs!$D$391+Inputs!$D$397)))","v":0.64723327857426294},{"$f":"IF(Inputs!$D$392+Inputs!$D$398=0,\"n/a/\",RATE(Inputs!$G$10,(Inputs!$D$148+Inputs!$D$191),(Inputs!$D$392+Inputs!$D$398),0,0,(Inputs!$D$148+Inputs!$D$191)/-(Inputs!$D$392+Inputs!$D$398)))","v":0.73374075175826547},{"$f":"IF(Inputs!$D$393+Inputs!$D$399=0,\"n/a/\",RATE(Inputs!$G$10,(Inputs!$D$148+Inputs!$D$191),(Inputs!$D$393+Inputs!$D$399),0,0,(Inputs!$D$148+Inputs!$D$191)/-(Inputs!$D$393+Inputs!$D$399)))","v":0.81884065899796143},{"$f":"IF(Inputs!$D$394+Inputs!$D$400=0,\"n/a/\",RATE(Inputs!$G$10,(Inputs!$D$148+Inputs!$D$191),(Inputs!$D$394+Inputs!$D$400),0,0,(Inputs!$D$148+Inputs!$D$191)/-(Inputs!$D$394+Inputs!$D$400)))","v":0.90282748880289743}]
[]
[]
[]
[]
[]
[]
[]
[]
[]
[]
[]
[]
[]
[]
[]
[]
[]
[]
[]
[]
[]
[]
[]
[]
[]
[]
[]
[]
[]
[]
[]
[]
[]
[]
[]
[]
[]
[]
[]
[]
[]
[]
[]
[]
[]
[]
[]
[]
[]
[]
[]
[]
[]
[]
[]
[]
[]
[]
[]
[]
[]
[]
[]
[]
[]
[]
[]
[]
[]
[]
[]
[]
[]
[]
[]
[]
[]
[]
[]
[]
[]
[]
[]
[]
[]
[]
[]
[]
[]
[]
[]
[]
[]
[]
[]
[]
[]
[]
[]
[]
[]
[]
[]
{"$rows_left_out":504}
{"sheet":"Fields","index":3,"n_rows":11,"n_cols":104,"rows_kept":11,"cut":false,"hidden":false,"merged":[]}
[]
[null,"All Fields Data"]
[]
[]
[null,"Field characteristics section",null,"Acre-wtd."]
[null,"Field name","units","average","Field #1","Field #2","Field #3","Field #4","Field #5","Field #6","Field #7","Field #8","Field #9","Field #10","Field #11","Field #12","Field #13","Field #14","Field #15","Field #16","Field #17","Field #18","Field #19","Field #20","Field #21","Field #22","Field #23","Field #24","Field #25","Field #26","Field #27","Field #28","Field #29","Field #30","Field #31","Field #32","Field #33","Field #34","Field #35","Field #36","Field #37","Field #38","Field #39","Field #40","Field #41","Field #42","Field #43","Field #44","Field #45","Field #46","Field #47","Field #48","Field #49","Field #50","Field #51","Field #52","Field #53","Field #54","Field #55","Field #56","Field #57","Field #58","Field #59","Field #60","Field #61","Field #62","Field #63","Field #64","Field #65","Field #66","Field #67","Field #68","Field #69","Field #70","Field #71","Field #72","Field #73","Field #74","Field #75","Field #76","Field #77","Field #78","Field #79","Field #80","Field #81","Field #82","Field #83","Field #84","Field #85","Field #86","Field #87","Field #88","Field #89","Field #90","Field #91","Field #92","Field #93","Field #94","Field #95","Field #96","Field #97","Field #98","Field #99","Field #100"]
[null,"Size of field","acres",{"$f":"(SUMPRODUCT(E7:CZ7,$E$7:$CZ$7))/$D$8","v":75.402234636871512},50,88,75,55,90]
[null,"Total acres","acres",{"$f":"SUM(E7:CZ7)","v":358}]
[null,"Maximum width of field, perpendicular to direction of swaths (passes)","feet",{"$f":"(SUMPRODUCT(E9:CZ9,$E$7:$CZ$7))/$D$8","v":1897.1927374301677},1690.5,2015,1897,1565,2100]
[null,"Running distance of headlands to cover for field","feet",{"$f":"(SUMPRODUCT(E10:CZ10,$E$7:$CZ$7))/$D$8","v":6000.0698324022351},7760,5000,6000,5755,6150]
[null,"Average angle of approach to headland in degrees (0-90)","degrees",null,{"$f":"IF(ISERR(DEGREES(ASIN(2*E9/E10))),\"\",DEGREES(ASIN(2*E9/E10)))","v":25.829581834142484},{"$f":"IF(ISERR(DEGREES(ASIN(2*F9/F10))),\"\",DEGREES(ASIN(2*F9/F10)))","v":53.706941506570416},{"$f":"IF(ISERR(DEGREES(ASIN(2*G9/G10))),\"\",DEGREES(ASIN(2*G9/G10)))","v":39.222482206987834},32.947811135161757,43.072781346752492,"","","","","","","","","","","","","","","","","","","","","","","","","","","","","","","","","","","","","","","","","","","","","",{"$f":"IF(ISERR(DEGREES(ASIN(2*BC9/BC10))),\"\",DEGREES(ASIN(2*BC9/BC10)))","v":""},"","","","","","","","","","","","","","","","","","","","","","","","","","","","","","","",{"$f":"IF(ISERR(DEGREES(ASIN(2*CI9/CI10))),\"\",DEGREES(ASIN(2*CI9/CI10)))","v":""},"","","","","","","","","","","","","","","","",""]

{"sheet":"Notes","index":4,"n_rows":110,"n_cols":5,"rows_kept":110,"cut":false,"hidden":false,"merged":[]}
[" "]
[null,"Figure 1.  Representation of how values in spreadsheet are calculated"]
[]
[]
[]
[]
[]
[]
[]
[]
[]
[]
[]
[]
[]
[]
[]
[]
[]
[]
[]
[]
[]
[]
[]
[]
[null,null,null,null," "]
[]
[]
[null,"Notes regarding how angle of approach is calculated given perimeter (running feet of headland)"]
[null,null,"and number of passes"]
[null,null,"p = perimeter distance per pass = running feet of headland divided by number of passes"]
[null,null,"c = p/2, or"]
[null,null,"w = width of swath"]
[null,null,"c = (w2 + b2)0.5"]
[null,null,"sine(a) = w/c, where angle a is expressed in radians"]
[null,null,"a = arcsine(w/c), where angle a is expressed in radians"," "]
[null,"Note that in Excel the angle must be expressed in radians for formulas to work"]
[]
[null,"Distance machine must travel into headland before whole boom can be shut off = b"]
[null,null,"tan(a) = w/b, where angle a is expressed in radians"]
[null,null,"b = w/tan(a), or"]
[null,null,"b = (c2 - w2)0.5"]
[null,"Crop input overlap area per pass = (Area A plus Q) times 2 since each pass has two ends"]
[null,null,"d = reaction distance of travel before manually shutoff boom"]
[null,null,"Q = d*w"]
[null,null,"Input overlap area per pass = (w*b/2 + Q)*2"]
[]
[null,"Notes about radians and degrees"]
[null,"A radian is defined this way:"]
[null,"If you have a circle with an angle whose vertex is at the center of that circle... "]
[null,"And if that angle is of such a size that the amount of the circumference of the circle which that angle intercepts"]
[null,null,"has an arc length equal to the length of the radius... "]
[null,"Then that angle has a measurement of one radian. "]
[null,"Here's another way to say it:"]
[null,"A central angle to a circle has a size of one radian if it subtends an arc length on the circle equal in length to"]
[null,null,"the radius."]
[null,"Excel formula for computing the number of degrees in a radian = 360/2/PI() "]
[null,"1 radian = 57.2957 degrees"]
[null,"1 degree = 0.0174532 radians"]
[null,"What is the reasoning behind these values? It works this way:"]
[null,"How many times can you trace an arc length equal to the size of the radius as you move around the "]
[null,null,"circumference of a circle? Well, here's the formula for the circumference of a circle:"]
[null,"C=2*pi*r"]
[null,"C is the circumference, and r is the radius."]
[null,"Looks like there are two pi radii around the circumference of a circle, or about 2 times 3.14, i.e., about 6.28, radii "]
[null,null,"around the circumference of a circle. Each one of these radius lengths would designate one radian, so there"]
[null,null,"are about 6.28 radians in a full circle."]
[]
[null,"A couple of relevant trigonometric functions:"]
[null,"Sine is the ratio of the length of the side opposite the acute angle to the hypotenuse in a right triangle."]
[null,"Tangent is the ratio of the length of the side opposite the acute angle to the adjacent side in a right triangle."]
[]
[]
[null,"Odd1 field (one on left in picture below)"]
[null,"167.4 acres; farmed north-south; 3960 feet west to east at widest point"]
[null,"Headland length is 16700 feet (whole perimeter)"]
[]
[]
[]
[]
[]
[]
[]
[]
[]
[]
[]
[]
[]
[]
[]
[]
[]
[]
[]
[]
[]
[]
[]
[]
[]
[]
[]
[]
[]
[]
[null,"Odd2 field"]
[null,"269.9 acres; farmed north-south; 5502 feet west to east at widest point"]
[null,"Headland length is 30690 feet (whole perimeter)"]

{"sheet":"Ammortization","index":5,"n_rows":34,"n_cols":7,"rows_kept":34,"cut":false,"hidden":false,"merged":[[30,1,32,6],[1,1,1,2]]}
[]
[null,"Amortization factors"]
[]
[null,null,"Interest Rate"]
[null,"Years",0.06,7.0000000000000007E-2,0.08,0.09,0.1]
[null,1,{"$f":"C$5/(1-(1+C$5)^(-$B6))","v":1.0599999999999981},1.07,1.0799999999999985,1.0899999999999992,1.0999999999999996]
[null,2,0.54543689320388289,0.55309178743961329,0.56076923076923058,0.56846889952153068,0.57619047619047592]
[null,3,0.374109812790551,0.38105166568166948,0.38803351404632802,0.39505475732894041,0.40211480362537733]
[null,4,0.2885914923732732,0.29522811666726351,0.30192080445403918,0.30866866209109761,0.31547080370609765]
[null,5,0.23739640043118937,0.24389069444137404,0.25045645456683652,0.25709245695674476,0.26379748079474524]
[null,6,0.20336262847489525,0.20979579975832816,0.21631538622900967,0.22291978329203693,0.22960738036266728]
[null,7,0.17913501805901066,0.18555321963115931,0.19207240142841048,0.19869051683359293,0.20540549970059557]
[null,8,0.16103594264812895,0.16746776249075465,0.17401476059182208,0.18067437783749626,0.18744401757481335]
[null,9,0.14702223500306358,0.15348647013842193,0.16007970917199471,0.1667988020571548,0.17364053907434343]
[null,10,0.13586795822038372,0.14237750272736471,0.14902948869707536,0.15582008990903373,0.16274539488251152]
[]
[null,"payment formula>",null,"PMT=PV*int/[1-(1+int)^(-N)]"]
[null,"payback time formula>",null,"N=-ln[1-PV*int/PMT]/ln(1+int)"]
[]
[null,null,null,"amortization","investment","payback","internal rate"]
[null,null,null,"mathematics","supported","in years","of return"]
[null,"interest rate (in)>",null,0.08,{"$f":"D22","v":0.08},{"$f":"D22","v":0.08},{"$f":"RATE(G23,G26,-G25,0,0,D22)","v":0.14418535244890601}]
[null,"number of years (N) >",null,4,{"$f":"D23","v":4},{"$f":"IF(E29<(D25*D22/D27),\"won't pay\",-LN(1-F25*D22/E26)/LN(1+D22))","v":3.4148291632617847},{"$f":"D23","v":4}]
[null,"payment factor>",null,{"$f":"D22/(1-(1+D22)^(-D23))","v":0.30192080445403918}]
[null,"investment (PV) >",null,13000,{"$f":"E29*E27*(1-(1+E22)^(-E23))/E22","v":14904.570780199503},{"$f":"D25","v":13000},{"$f":"D25","v":13000}]
[null,"annual payment (PMT) >",null,{"$f":"D22/(1-(1+D22)^(-D23))*D25","v":3924.9704579025092},{"$f":"D27*E29","v":4500},{"$f":"E27*F29","v":4500},{"$f":"F27*G29","v":4500}]
[null,"acres used on annually>",null,15000,{"$f":"D27","v":15000},{"$f":"E27","v":15000},{"$f":"F27","v":15000}]
[null,"investment per acre>",null,{"$f":"D25/D27","v":0.8666666666666667}]
[null,"annual cost/benefit per acre>",null,{"$f":"D26/D27","v":0.26166469719350061},0.3,{"$f":"E29","v":0.3},{"$f":"F29","v":0.3}]
[]
[null,"Note: The information contained in this tab is for illustrative purposes only.  Calculated values in the Results tab are based on information entered in the Inputs tab, but using the concepts shown here."]
[]
[]
[null,null,null," "]