{"text_format":"1","workbook":"xlsx","n_sheets":5,"sheets":["Introduction","User input","Time and Tax (TT)","Analysis summary","Baler Models"],"not_rendered":{"charts":0,"images":4,"macros":1,"external_links":0,"defined_names":1,"comments":1,"pivot_tables":0},"unopened":[],"bounds":{"document_bytes":16777216,"sheet_cells":100000,"rows_first":2000,"rows_last":500,"rows_between":2000,"halvings":0,"cell_chars":16384,"cell_head_chars":4096},"cells_cut":0,"cells_raw":0,"read":"whole","date_system":"1900"}

{"sheet":"Introduction","index":0,"n_rows":128,"n_cols":12,"rows_kept":128,"cut":false,"hidden":false,"merged":[[39,1,40,4],[39,6,40,10],[44,1,44,3],[50,1,50,11],[1,1,2,6],[29,1,32,11],[25,1,25,4],[26,1,28,11],[36,1,36,9],[37,1,38,8],[4,1,5,8],[7,2,7,3],[7,4,7,5]]}
[]
[null,"KSU-Own Baler"]
[]
[]
[null,"An Excel spreadsheet to evaluate the economic costs of owning and operating a large square or large round hay baler."]
[]
[]
[null,null,null,null,null,null,null,null,null,null,null,"Version- 6.30.16"]
[]
[]
[]
[]
[]
[]
[]
{"$rows_left_out":114}
{"sheet":"User input","index":1,"n_rows":75,"n_cols":13,"rows_kept":75,"cut":false,"hidden":false,"merged":[[5,1,5,2]]}
[]
[null,"User Input and related calculations section (blue shaded cells are inputs)"]
[]
[null,"Information pertaining to baler depreciation and repairs"]
[null,null,null,null,null,null,null,null,"repair factors"]
[null,"Baler class",null,null,null,null,"age","usage","RF1","RF2","useful life"]
[null,1,"Large round baler",null,null,null,{"$f":"+Introduction!D86","v":-5.7636583260407437E-2},{"$f":"+Introduction!E86","v":-1E-3},{"$f":"Introduction!H86","v":0.55000000000000004},{"$f":"Introduction!I86","v":1.8},{"$f":"Introduction!J86","v":1500}]
[null,2,"Large square baler",null,null,null,{"$f":"+Introduction!D87","v":-7.7698505043562113E-2},{"$f":"+Introduction!E87","v":-2.5000000000000001E-4},{"$f":"Introduction!H87","v":0.25},{"$f":"Introduction!I87","v":1.8},{"$f":"Introduction!J87","v":3000}]
[null,"Factors used in analysis =>",null,null,null,{"$f":"IF($F12=1,C7,IF($F12=2,C8,\"NA\"))","v":"Large round baler"},{"$f":"IF($F12=1,G7,IF($F12=2,G8,\"NA\"))","v":-5.7636583260407437E-2},{"$f":"IF($F12=1,H7,IF($F12=2,H8,\"NA\"))","v":-1E-3},{"$f":"IF($F12=1,I7,IF($F12=2,I8,\"NA\"))","v":0.55000000000000004},{"$f":"IF($F12=1,J7,IF($F12=2,J8,\"NA\"))","v":1.8},{"$f":"IF($F12=1,K7,IF($F12=2,K8,\"NA\"))","v":1500}]
[]
[null,"Information on baler considered for purchase",null,null,null,null,null,"Tractor, labor, and fuel information"]
[null,"   Baler class:  big round = 1;  big square = 2",null,null,null,1,null,"   PTO horsepower of tractor used on baler",null,null,null,150]
[null,"   Round bale only:  percent of bales with net wrap",null,null,null,1,null,"   Tractor rental rate in dollars per hp per hour",null,null,null,0.2]
[null,"   Baler age in years",null,null,null,0,null,"   Tractor rental rate in dollars per hourmeter hour",null,null,null,{"$f":"L12*L13","v":30}]
[null,"   Accumulated number of bales on purchased baler",null,null,null,0,null,"   Tractor fuel consumption per hourmeter hour (gal.)",null,null,null,8]
{"$rows_left_out":61}
{"sheet":"Time and Tax (TT)","index":2,"n_rows":36,"n_cols":24,"rows_kept":36,"cut":false,"hidden":false,"merged":[]}
[]
[null,"Time and tax (TT) section"]
[]
[null,null,null,null,null,null,null,null,null,null,null,null,null,null,null,null,null,null,null,"After-tax net present value of costs (NPVc) =>",{"$f":"SUM(U12:U32)","v":7737.3249746155079}]
[]
[null,null,null,null,null,"after-tax NPV =>",{"$f":"SUMPRODUCT($C12:$C32,G12:G32)*(1-'User input'!$L25-'User input'!$L26)","v":2605.9961005561586},{"$f":"SUMPRODUCT($C12:$C32,H12:H32)*(1-'User input'!$L25-'User input'!$L26)","v":2510.9338240386005},null,null,null,null,null,"after-tax NPV =>",{"$f":"SUMPRODUCT($C12:$C32,O12:O32)*(1-'User input'!$L25-'User input'!$L26)","v":781.79883016684767},null,{"$f":"SUMPRODUCT($C12:$C32,Q12:Q32)*(1-'User input'!$L25-'User input'!$L26)","v":2999.1460668865275}]
[null,null,null,null,null,"% of total =>",{"$f":"G6/($G6+$H6+$O6+$Q6)","v":0.29287848534527439},{"$f":"H6/($G6+$H6+$O6+$Q6)","v":0.28219477958148059},null,null,null,null,null,"% of total =>",{"$f":"O6/($G6+$H6+$O6+$Q6)","v":8.7863545603582324E-2},null,{"$f":"Q6/($G6+$H6+$O6+$Q6)","v":0.3370631894696629}]
[null,null,null,null,null,null,null,null,null,null,"EOY*"]
[null,null,"after-tax","EOY*","EOY*","est.",null,null,"tax","Sec. 179","or year",null,null,null,null,null,{"$f":"SUM(Q12:Q32)/'User input'!F24","v":1666.732205737386},{"$f":"SUM(R12:R32)/'User input'!F24","v":9.8683190921358488}]
[null,null,"discount","machine","machine","machine","opp.","market","deprec.","and tax","of sale","loan","loan","downpmt",null,"accum.","annual","repairs","tax","net","discounted"]
[null,"year","factor","age","hours","value","interest","deprec.","rate","deprec.","tax basis","interest","principal","or sale","TIS**","repairs","repairs","per hour","savings","cash out","cash out"]
[null,0,{"$f":"IF(B12>'User input'!F$24,\"\",'User input'!F$50^B12)","v":1},{"$f":"IF(B12>'User input'!F$24,\"\",IF(B12=0,'User input'!F$14,D11+1))","v":0},{"$f":"IF(B12>'User input'!F$24,\"\",IF(B12=0,'User input'!F$19,E11+'User input'!F$43))","v":0},{"$f":"IF(B12>'User input'!F$24,\"\",EXP('User input'!G$9*(D12-'User input'!F$14)+'User input'!H$9*((E12-'User input'!F$19)/100))*'User input'!F$21*(1+'User input'!F$45)^B12)","v":30000},{"$f":"IF(B12>'User input'!F$24,\"\",IF(B12>0,F11*'User input'!L$23,0))","v":0},{"$f":"IF(B12>'User input'!F$24,\"\",IF(B12>0,F11-F12,0))","v":0},{"$f":"IF(B12>'User input'!F$24,\"\",IF(B12>7,0,IF(SUM(I$11:I11)<1,IF(B12='User input'!F$24,'User input'!L33/2,'User input'!L33),0)))","v":0.1429},{"$f":"IF(B12>'User input'!F$24,\"\",IF(B12=0,MIN('User input'!F$20,'User input'!L$28)+'User input'!L$31+'User input'!L$32*I12,'User input'!L$32*I12))","v":4287},{"$f":"IF(B12>'User input'!F$24,\"\",IF(B12=0,'User input'!F$20-J12,K11-J12))","v":25713},{"$f":"IF(B12>'User input'!F$24,\"\",IF(B12>0,('User input'!F$20-'User input'!F$22)*'User input'!L$23,0))","v":0},{"$f":"IF(B12>'User input'!F$24,\"\",IF(B12='User input'!F$24,'User input'!F$20-'User input'!F$22,0))","v":0},{"$f":"IF(B12>'User input'!F$24,\"\",IF(B12=0,'User input'!F$22,IF(B12='User input'!F$24,-F12*(1-'User input'!F$46),0)))","v":12000},{"$f":"IF(B12>'User input'!F$24,\"\",IF(B12>0,'User input'!F$48*F11,0))","v":0},{"$f":"IF(B12>'User input'!F$24,\"\",(IF(E12>'User input'!K$9,(E12-'User input'!K$9)*('User input'!F$23*(1+'User input'!F$45)^B12*'User input'!J$9*'User input'!I$9*('User input'!K$9/1000)^('User input'!J$9-1))/1000+'User input'!I$9*'User input'!F$23*(1+'User input'!F$45)^B12*('User input'!K$9/1000)^'User input'!J$9,'User input'!I$9*'User input'!F$23*(1+'User input'!F$45)^B12*(E12/1000)^'User input'!J$9))*'User input'!F$47)","v":0},{"$f":"IF(B12>'User input'!F$24,\"\",IF(B12>0,(P12-P11),0))","v":0},{"$f":"IF(B12>'User input'!F$24,\"\",Q12/'User input'!F$43)","v":0},{"$f":"IF(B12>'User input'!F$24,\"\",(J12+L12+O12+Q12)*('User input'!L$25+'User input'!L$26)-IF(B12='User input'!F$24,(F12-K12)*'User input'!L$25,0))","v":1513.3109999999999},{"$f":"IF(B12>'User input'!F$24,\"\",L12+M12+N12+O12+Q12-S12)","v":10486.689},{"$f":"IF(B12>'User input'!F$24,\"\",C12*T12)","v":10486.689}]
[null,{"$f":"IF(B12>='User input'!F$24,\"\",B12+1)","v":1},{"$f":"IF(B13>'User input'!F$24,\"\",'User input'!F$50^B13)","v":0.96866372838669046},{"$f":"IF(B13>'User input'!F$24,\"\",IF(B13=0,'User input'!F$14,D12+1))","v":1},{"$f":"IF(B13>'User input'!F$24,\"\",IF(B13=0,'User input'!F$19,E12+'User input'!F$43))","v":168.89727522751267},{"$f":"IF(B13>'User input'!F$24,\"\",EXP('User input'!G$9*(D13-'User input'!F$14)+'User input'!H$9*((E13-'User input'!F$19)/100))*'User input'!F$21*(1+'User input'!F$45)^B13)","v":28554.717432135029},{"$f":"IF(B13>'User input'!F$24,\"\",IF(B13>0,F12*'User input'!L$23,0))","v":1500},{"$f":"IF(B13>'User input'!F$24,\"\",IF(B13>0,F12-F13,0))","v":1445.2825678649715},{"$f":"IF(B13>'User input'!F$24,\"\",IF(B13>7,0,IF(SUM(I$11:I12)<1,IF(B13='User input'!F$24,'User input'!L34/2,'User input'!L34),0)))","v":0.24490000000000001},{"$f":"IF(B13>'User input'!F$24,\"\",IF(B13=0,MIN('User input'!F$20,'User input'!L$28)+'User input'!L$31+'User input'!L$32*I13,'User input'!L$32*I13))","v":7347},{"$f":"IF(B13>'User input'!F$24,\"\",IF(B13=0,'User input'!F$20-J13,K12-J13))","v":18366},{"$f":"IF(B13>'User input'!F$24,\"\",IF(B13>0,('User input'!F$20-'User input'!F$22)*'User input'!L$23,0))","v":900},{"$f":"IF(B13>'User input'!F$24,\"\",IF(B13='User input'!F$24,'User input'!F$20-'User input'!F$22,0))","v":0},{"$f":"IF(B13>'User input'!F$24,\"\",IF(B13=0,'User input'!F$22,IF(B13='User input'!F$24,-F13*(1-'User input'!F$46),0)))","v":0},{"$f":"IF(B13>'User input'!F$24,\"\",IF(B13>0,'User input'!F$48*F12,0))","v":450},{"$f":"IF(B13>'User input'!F$24,\"\",(IF(E13>'User input'!K$9,(E13-'User input'!K$9)*('User input'!F$23*(1+'User input'!F$45)^B13*'User input'!J$9*'User input'!I$9*('User input'!K$9/1000)^('User input'!J$9-1))/1000+'User input'!I$9*'User input'!F$23*(1+'User input'!F$45)^B13*('User input'!K$9/1000)^'User input'!J$9,'User input'!I$9*'User input'!F$23*(1+'User input'!F$45)^B13*(E13/1000)^'User input'!J$9))*'User input'!F$47)","v":678.46285551765425},{"$f":"IF(B13>'User input'!F$24,\"\",IF(B13>0,(P13-P12),0))","v":678.46285551765425},{"$f":"IF(B13>'User input'!F$24,\"\",Q13/'User input'!F$43)","v":4.0170148073953973},{"$f":"IF(B13>'User input'!F$24,\"\",(J13+L13+O13+Q13)*('User input'!L$25+'User input'!L$26)-IF(B13='User input'!F$24,(F13-K13)*'User input'!L$25,0))","v":3309.5383879977321},{"$f":"IF(B13>'User input'!F$24,\"\",L13+M13+N13+O13+Q13-S13)","v":-1281.075532480078},{"$f":"IF(B13>'User input'!F$24,\"\",C13*T13)","v":-1240.931401637117}]
[null,{"$f":"IF(B13>='User input'!F$24,\"\",B13+1)","v":2},{"$f":"IF(B14>'User input'!F$24,\"\",'User input'!F$50^B14)","v":0.93830941869200402},{"$f":"IF(B14>'User input'!F$24,\"\",IF(B14=0,'User input'!F$14,D13+1))","v":2},{"$f":"IF(B14>'User input'!F$24,\"\",IF(B14=0,'User input'!F$19,E13+'User input'!F$43))","v":337.79455045502533},{"$f":"IF(B14>'User input'!F$24,\"\",EXP('User input'!G$9*(D14-'User input'!F$14)+'User input'!H$9*((E14-'User input'!F$19)/100))*'User input'!F$21*(1+'User input'!F$45)^B14)","v":27179.062920969209},{"$f":"IF(B14>'User input'!F$24,\"\",IF(B14>0,F13*'User input'!L$23,0))","v":1427.7358716067515},{"$f":"IF(B14>'User input'!F$24,\"\",IF(B14>0,F13-F14,0))","v":1375.6545111658197},{"$f":"IF(B14>'User input'!F$24,\"\",IF(B14>7,0,IF(SUM(I$11:I13)<1,IF(B14='User input'!F$24,'User input'!L35/2,'User input'!L35),0)))","v":0.1749},{"$f":"IF(B14>'User input'!F$24,\"\",IF(B14=0,MIN('User input'!F$20,'User input'!L$28)+'User input'!L$31+'User input'!L$32*I14,'User input'!L$32*I14))","v":5247},{"$f":"IF(B14>'User input'!F$24,\"\",IF(B14=0,'User input'!F$20-J14,K13-J14))","v":13119},{"$f":"IF(B14>'User input'!F$24,\"\",IF(B14>0,('User input'!F$20-'User input'!F$22)*'User input'!L$23,0))","v":900},{"$f":"IF(B14>'User input'!F$24,\"\",IF(B14='User input'!F$24,'User input'!F$20-'User input'!F$22,0))","v":0},{"$f":"IF(B14>'User input'!F$24,\"\",IF(B14=0,'User input'!F$22,IF(B14='User input'!F$24,-F14*(1-'User input'!F$46),0)))","v":0},{"$f":"IF(B14>'User input'!F$24,\"\",IF(B14>0,'User input'!F$48*F13,0))","v":428.32076148202543},{"$f":"IF(B14>'User input'!F$24,\"\",(IF(E14>'User input'!K$9,(E14-'User input'!K$9)*('User input'!F$23*(1+'User input'!F$45)^B14*'User input'!J$9*'User input'!I$9*('User input'!K$9/1000)^('User input'!J$9-1))/1000+'User input'!I$9*'User input'!F$23*(1+'User input'!F$45)^B14*('User input'!K$9/1000)^'User input'!J$9,'User input'!I$9*'User input'!F$23*(1+'User input'!F$45)^B14*(E14/1000)^'User input'!J$9))*'User input'!F$47)","v":2386.1703330274195},{"$f":"IF(B14>'User input'!F$24,\"\",IF(B14>0,(P14-P13),0))","v":1707.7074775097653},{"$f":"IF(B14>'User input'!F$24,\"\",Q14/'User input'!F$43)","v":10.110923786126225},{"$f":"IF(B14>'User input'!F$24,\"\",(J14+L14+O14+Q14)*('User input'!L$25+'User input'!L$26)-IF(B14='User input'!F$24,(F14-K14)*'User input'!L$25,0))","v":2923.9089683641023},{"$f":"IF(B14>'User input'!F$24,\"\",L14+M14+N14+O14+Q14-S14)","v":112.11927062768837},{"$f":"IF(B14>'User input'!F$24,\"\",C14*T14)","v":105.20256764683775}]
[null,{"$f":"IF(B14>='User input'!F$24,\"\",B14+1)","v":3},{"$f":"IF(B15>'User input'!F$24,\"\",'User input'!F$50^B15)","v":0.90890629989054483},{"$f":"IF(B15>'User input'!F$24,\"\",IF(B15=0,'User input'!F$14,D14+1))","v":3},{"$f":"IF(B15>'User input'!F$24,\"\",IF(B15=0,'User input'!F$19,E14+'User input'!F$43))","v":506.69182568253802},{"$f":"IF(B15>'User input'!F$24,\"\",EXP('User input'!G$9*(D15-'User input'!F$14)+'User input'!H$9*((E15-'User input'!F$19)/100))*'User input'!F$21*(1+'User input'!F$45)^B15)","v":25869.682059283143},{"$f":"IF(B15>'User input'!F$24,\"\",IF(B15>0,F14*'User input'!L$23,0))","v":1358.9531460484604},{"$f":"IF(B15>'User input'!F$24,\"\",IF(B15>0,F14-F15,0))","v":1309.3808616860661},{"$f":"IF(B15>'User input'!F$24,\"\",IF(B15>7,0,IF(SUM(I$11:I14)<1,IF(B15='User input'!F$24,'User input'!L36/2,'User input'!L36),0)))","v":6.2449999999999999E-2},{"$f":"IF(B15>'User input'!F$24,\"\",IF(B15=0,MIN('User input'!F$20,'User input'!L$28)+'User input'!L$31+'User input'!L$32*I15,'User input'!L$32*I15))","v":1873.5},{"$f":"IF(B15>'User input'!F$24,\"\",IF(B15=0,'User input'!F$20-J15,K14-J15))","v":11245.5},{"$f":"IF(B15>'User input'!F$24,\"\",IF(B15>0,('User input'!F$20-'User input'!F$22)*'User input'!L$23,0))","v":900},{"$f":"IF(B15>'User input'!F$24,\"\",IF(B15='User input'!F$24,'User input'!F$20-'User input'!F$22,0))","v":18000},{"$f":"IF(B15>'User input'!F$24,\"\",IF(B15=0,'User input'!F$22,IF(B15='User input'!F$24,-F15*(1-'User input'!F$46),0)))","v":-24576.197956318985},{"$f":"IF(B15>'User input'!F$24,\"\",IF(B15>0,'User input'!F$48*F14,0))","v":407.68594381453812},{"$f":"IF(B15>'User input'!F$24,\"\",(IF(E15>'User input'!K$9,(E15-'User input'!K$9)*('User input'!F$23*(1+'User input'!F$45)^B15*'User input'!J$9*'User input'!I$9*('User input'!K$9/1000)^('User input'!J$9-1))/1000+'User input'!I$9*'User input'!F$23*(1+'User input'!F$45)^B15*('User input'!K$9/1000)^'User input'!J$9,'User input'!I$9*'User input'!F$23*(1+'User input'!F$45)^B15*(E15/1000)^'User input'!J$9))*'User input'!F$47)","v":5000.1966172121583},{"$f":"IF(B15>'User input'!F$24,\"\",IF(B15>0,(P15-P14),0))","v":2614.0262841847389},{"$f":"IF(B15>'User input'!F$24,\"\",Q15/'User input'!F$43)","v":15.477018682885921},{"$f":"IF(B15>'User input'!F$24,\"\",(J15+L15+O15+Q15)*('User input'!L$25+'User input'!L$26)-IF(B15='User input'!F$24,(F15-K15)*'User input'!L$25,0))","v":-879.12649537288439},{"$f":"IF(B15>'User input'!F$24,\"\",L15+M15+N15+O15+Q15-S15)","v":-1775.3592329468236},{"$f":"IF(B15>'User input'!F$24,\"\",C15*T15)","v":-1613.6351913942133}]
{"$rows_left_out":22}
{"sheet":"Analysis summary","index":3,"n_rows":40,"n_cols":10,"rows_kept":40,"cut":false,"hidden":false,"merged":[]}
[]
[null,"Baler analysis summary section"]
[]
[null,"Analysis highlights:"]
[null,"Baler class used",null,null,null,{"$f":"VLOOKUP('User input'!F12,'User input'!B7:I8,2)","v":"Large round baler"},null,{"$f":"IF('User input'!F12=2,\"\",\"(using \"&FIXED((1-'User input'!F13)*100,0)&\"% twine and \"&FIXED('User input'!F13*100,0)&\"% net wrap)\")","v":"(using 0% twine and 100% net wrap)"}]
[]
[null,"Baler purchase price",null,null,null,{"$f":"'User input'!F20","v":30000}]
[null,"Baler age when purchased",null,null,null,{"$f":"'User input'!F14","v":0}]
[null,"Bales on baler when purchased",null,null,null,{"$f":"'User input'!F15","v":0}]
[null,"Estimated hours on baler when purchased",null,null,null,{"$f":"'User input'!F19","v":0}]
[null,"Average weight of bales in lb",null,null,null,{"$f":"'User input'!F32","v":1700}]
[null,"Bales made by baler per year",null,null,null,{"$f":"'User input'!F41","v":5000}]
[null,"Tons of hay baled per year",null,null,null,{"$f":"F11*F12/2000","v":4250}]
[null,"Hours put on baler per year",null,null,null,{"$f":"'User input'!F43","v":168.89727522751267}]
[null,"Hours put on tractor hourmeter per year",null,null,null,{"$f":"'User input'!L19","v":295.57023164814717}]
{"$rows_left_out":26}
{"sheet":"Baler Models","index":4,"n_rows":197,"n_cols":6,"rows_kept":197,"cut":false,"hidden":false,"merged":[]}
[]
[null,null,"Table 1.  Selected baler models and associated measurements1"]
[]
[null,null,null,null,"Bale width","Bale height"]
[null,null,"Brand","Model","(inches)","(inches)"]
[null,"Square Balers"]
[null,null,"AGCO Hesston ",2170,47,34.4]
[null,null,"AGCO Hesston ",2190,47.25,50]
[null,null,"AGCO Hesston ",4700,31,32.5]
[null,null,"AGCO Hesston ",4750,31.5,34.4]
[null,null,"AGCO Hesston ",4755,31.5,34.4]
[null,null,"AGCO Hesston ",4760,31.5,34.4]
[null,null,"AGCO Hesston ",4790,47.25,34.4]
[null,null,"AGCO Hesston ",4800,46.5,50]
[null,null,"AGCO Hesston ",4900,46.5,50]
{"$rows_left_out":182}