{"text_format":"1","workbook":"xlsx","n_sheets":4,"sheets":["Introduction","User input","Time and Tax (TT)","Analysis summary"],"not_rendered":{"charts":1,"images":3,"macros":1,"external_links":1,"defined_names":21,"comments":2,"pivot_tables":0},"unopened":[],"bounds":{"document_bytes":16777216,"sheet_cells":100000,"rows_first":2000,"rows_last":500,"rows_between":2000,"halvings":0,"cell_chars":16384,"cell_head_chars":4096},"cells_cut":0,"cells_raw":0,"read":"whole","date_system":"1900"}

{"sheet":"Introduction","index":0,"n_rows":44,"n_cols":12,"rows_kept":44,"cut":false,"hidden":false,"merged":[[43,1,44,11],[28,1,29,11],[30,1,31,11],[35,1,36,4],[35,6,36,10],[39,15,39,16],[40,1,40,3],[4,1,5,8],[4,13,5,23],[7,2,7,3],[7,4,7,5],[7,13,8,13],[27,1,27,4]]}
[]
[]
[null,"KSU-Own Combine"]
[]
[null,"An Excel spreadsheet to evaluate the economic costs of owning and operating a combine."]
[]
[]
[null,null,null,null,null,null,null,null,null,null,null,"Version- 6.30.16"]
[]
[]
[]
[]
[]
[]
[]
{"$rows_left_out":30}
{"sheet":"User input","index":1,"n_rows":77,"n_cols":13,"rows_kept":77,"cut":false,"hidden":false,"merged":[[5,1,5,2]]}
[]
[null,"User Input and related calculations section (blue shaded cells are inputs)"]
[]
[null,"Information pertaining to combine depreciation and repairs"]
[null,null,null,null,null,null,null,null,null,"repair factors"]
[null,"Combine class",null,null,null,null,"age","100 hrs","age*100hrs","RF1","RF2","useful life"]
[null,1,"JD 9670STS (spread 8r corn 30' rigid)",null,null,null,-9.3716922929405477E-2,-2.8173236964901704E-2,1.5204710545111411E-3,0.04,2.1,3000]
[null,2,"JD 9770STS (spread 12r corn 36' draper)",null,null,null,-4.977727849988689E-2,-3.0907359816129798E-2,1.5124023926249563E-4,0.04,2.1,3000]
[null,3,"AGCO R75 (spread 12r corn 36' draper)",null,null,null,-5.5594748747834544E-2,-1.7779504234320953E-2,-7.7802626359957383E-4,0.04,2.1,3000]
[null,4,"Case-IH 2588 (spread 8r corn 30' rigid)",null,null,null,-4.7097098925792835E-2,-2.5067889121032749E-2,-6.4932937438055838E-4,0.04,2.1,3000]
[null,null,"Factors used in analysis =>",null,null,{"$f":"IF($F13=1,C7,IF($F13=2,C8,IF($F13=3,C9,IF($F13=4,C10,IF($F13=5,#REF!,IF($F13=6,#REF!,\"NA\"))))))","v":"JD 9670STS (spread 8r corn 30' rigid)"},{"$f":"IF($F13=1,G7,IF($F13=2,G8,IF($F13=3,G9,IF($F13=4,G10,IF($F13=5,#REF!,IF($F13=6,#REF!,\"NA\"))))))","v":-9.3716922929405477E-2},{"$f":"IF($F13=1,H7,IF($F13=2,H8,IF($F13=3,H9,IF($F13=4,H10,IF($F13=5,#REF!,IF($F13=6,#REF!,\"NA\"))))))","v":-2.8173236964901704E-2},{"$f":"IF($F13=1,I7,IF($F13=2,I8,IF($F13=3,I9,IF($F13=4,I10,IF($F13=5,#REF!,IF($F13=6,#REF!,\"NA\"))))))","v":1.5204710545111411E-3},{"$f":"IF($F13=1,J7,IF($F13=2,J8,IF($F13=3,J9,IF($F13=4,J10,IF($F13=5,#REF!,IF($F13=6,#REF!,\"NA\"))))))","v":0.04},{"$f":"IF($F13=1,K7,IF($F13=2,K8,IF($F13=3,K9,IF($F13=4,K10,IF($F13=5,#REF!,IF($F13=6,#REF!,\"NA\"))))))","v":2.1},{"$f":"IF($F13=1,L7,IF($F13=2,L8,IF($F13=3,L9,IF($F13=4,L10,IF($F13=5,#REF!,IF($F13=6,#REF!,\"NA\"))))))","v":3000}]
[]
[null,"Combine class (1-4)",null,null,null,1,null,"Bank interest rate (enter as decimal)",null,null,null,0.05]
[null,"Combine age in years",null,null,null,0,null,"Calculated after-tax discount rate",null,null,null,{"$f":"L13*(1-L15-L16)","v":3.2350000000000004E-2}]
[null,"Separator hours on combine",null,null,null,0,null,"State + U.S. marginal income tax rate (decimal)",null,null,null,0.2]
{"$rows_left_out":63}
{"sheet":"Time and Tax (TT)","index":2,"n_rows":83,"n_cols":24,"rows_kept":83,"cut":false,"hidden":false,"merged":[]}
[]
[null,"Time and tax (TT) section"]
[]
[null,null,null,null,null,null,null,null,null,null,null,null,null,null,null,null,null,null,null,"After-tax net present value of costs (NPVc) =>",{"$f":"SUM(U12:U32)","v":121453.29757077806}]
[]
[null,null,null,null,null,"after-tax NPV =>",{"$f":"SUMPRODUCT($C12:$C32,G12:G32)*(1-'User input'!$L15-'User input'!$L16)","v":30775.112696295026},{"$f":"SUMPRODUCT($C12:$C32,H12:H32)*(1-'User input'!$L15-'User input'!$L16)","v":84574.68102098658},null,null,null,null,null,"after-tax NPV =>",{"$f":"SUMPRODUCT($C12:$C32,O12:O32)*(1-'User input'!$L15-'User input'!$L16)","v":9232.5338088885073},null,{"$f":"SUMPRODUCT($C12:$C32,Q12:Q32)*(1-'User input'!$L15-'User input'!$L16)","v":11575.33151136478}]
[null,null,null,null,null,"% of total =>",{"$f":"G6/($G6+$H6+$O6+$Q6)","v":0.22602557148703023},{"$f":"H6/($G6+$H6+$O6+$Q6)","v":0.6211525787004879},null,null,null,null,null,"% of total =>",{"$f":"O6/($G6+$H6+$O6+$Q6)","v":6.7807671446109066E-2},null,{"$f":"Q6/($G6+$H6+$O6+$Q6)","v":8.5014178366372942E-2}]
[null,null,null,null,null,null,null,null,null,null,"EOY*"]
[null,null,"after-tax","EOY*","EOY*","est.",null,null,"tax","Sec. 179","or year",null,null,null,null,null,null,{"$f":"SUM(R12:R32)/'User input'!F21","v":16.169311949286499}]
[null,null,"discount","machine","machine","machine","opp.","market","deprec.","and tax","of sale","loan","loan","downpmt",null,"accum.","annual","repairs","tax","net","discounted"]
[null,"year","factor","age","hours","value","interest","deprec.","rate","deprec.","tax basis","interest","principal","or sale","TIS**","repairs","repairs","per hour","savings","cash out","cash out"]
[null,0,{"$f":"IF(B12>'User input'!F$21,\"\",'User input'!F$38^B12)","v":1},{"$f":"IF(B12>'User input'!F$21,\"\",IF(B12=0,'User input'!F$14,D11+1))","v":0},{"$f":"IF(B12>'User input'!F$21,\"\",IF(B12=0,'User input'!F$15,E11+'User input'!F$22))","v":0},{"$f":"IF(B12>'User input'!F$21,\"\",IF(F$57=1,F60,IF(F$57=2,H60,\"Error\")))","v":275000},{"$f":"IF(B12>'User input'!F$21,\"\",IF(B12>0,F11*'User input'!L$13,0))","v":0},{"$f":"IF(B12>'User input'!F$21,\"\",IF(B12>0,F11-F12,0))","v":0},{"$f":"IF(B12>'User input'!F$21,\"\",IF(B12>7,0,IF(SUM(I$11:I11)<1,IF(B12='User input'!F$21,'User input'!L22/2,'User input'!L22),0)))","v":0.1429},{"$f":"IF(B12>'User input'!F$21,\"\",IF(B12=0,MIN('User input'!F$16,'User input'!L$17)+'User input'!L$19+'User input'!L$20*I12,'User input'!L$20*I12))","v":39297.5},{"$f":"IF(B12>'User input'!F$21,\"\",IF(B12=0,'User input'!F$16-J12,K11-J12))","v":235702.5},{"$f":"IF(B12>'User input'!F$21,\"\",IF(B12>0,('User input'!F$16-'User input'!F$18)*'User input'!L$13,0))","v":0},{"$f":"IF(B12>'User input'!F$21,\"\",IF(B12='User input'!F$21,'User input'!F$16-'User input'!F$18,0))","v":0},{"$f":"IF(B12>'User input'!F$21,\"\",IF(B12=0,'User input'!F$18,IF(B12='User input'!F$21,-F12,0)))","v":50000},{"$f":"IF(B12>'User input'!F$21,\"\",IF(B12>0,'User input'!F$35*F11,0))","v":0},{"$f":"IF(B12>'User input'!F$21,\"\",(IF(E12>'User input'!L$11,(E12-'User input'!L$11)*'User input'!F$34+'User input'!J$11*'User input'!F$19*'User input'!F$32*('User input'!L$11/1000)^'User input'!K$11,'User input'!J$11*'User input'!F$19*'User input'!F$32*(E12/1000)^'User input'!K$11))*'User input'!F$33)","v":0},{"$f":"IF(B12>'User input'!F$21,\"\",IF(B12>0,(P12-P11),0))","v":0},{"$f":"IF(B12>'User input'!F$21,\"\",Q12/'User input'!F$22)","v":0},{"$f":"IF(B12>'User input'!F$21,\"\",(J12+L12+O12+Q12)*('User input'!L$15+'User input'!L$16)-IF(B12='User input'!F$21,(F12-K12)*'User input'!L$15,0))","v":13872.0175},{"$f":"IF(B12>'User input'!F$21,\"\",L12+M12+N12+O12+Q12-S12)","v":36127.982499999998},{"$f":"IF(B12>'User input'!F$21,\"\",C12*T12)","v":36127.982499999998}]
[null,{"$f":"IF(B12>='User input'!F$21,\"\",B12+1)","v":1},{"$f":"IF(B13>'User input'!F$21,\"\",'User input'!F$38^B13)","v":0.96866372838669046},{"$f":"IF(B13>'User input'!F$21,\"\",IF(B13=0,'User input'!F$14,D12+1))","v":1},{"$f":"IF(B13>'User input'!F$21,\"\",IF(B13=0,'User input'!F$15,E12+'User input'!F$22))","v":250},{"$f":"IF(B13>'User input'!F$21,\"\",IF(F$57=1,F61,IF(F$57=2,H61,\"Error\")))","v":234257.80975407595},{"$f":"IF(B13>'User input'!F$21,\"\",IF(B13>0,F12*'User input'!L$13,0))","v":13750},{"$f":"IF(B13>'User input'!F$21,\"\",IF(B13>0,F12-F13,0))","v":40742.190245924052},{"$f":"IF(B13>'User input'!F$21,\"\",IF(B13>7,0,IF(SUM(I$11:I12)<1,IF(B13='User input'!F$21,'User input'!L23/2,'User input'!L23),0)))","v":0.24490000000000001},{"$f":"IF(B13>'User input'!F$21,\"\",IF(B13=0,MIN('User input'!F$16,'User input'!L$17)+'User input'!L$19+'User input'!L$20*I13,'User input'!L$20*I13))","v":67347.5},{"$f":"IF(B13>'User input'!F$21,\"\",IF(B13=0,'User input'!F$16-J13,K12-J13))","v":168355},{"$f":"IF(B13>'User input'!F$21,\"\",IF(B13>0,('User input'!F$16-'User input'!F$18)*'User input'!L$13,0))","v":11250},{"$f":"IF(B13>'User input'!F$21,\"\",IF(B13='User input'!F$21,'User input'!F$16-'User input'!F$18,0))","v":0},{"$f":"IF(B13>'User input'!F$21,\"\",IF(B13=0,'User input'!F$18,IF(B13='User input'!F$21,-F13,0)))","v":0},{"$f":"IF(B13>'User input'!F$21,\"\",IF(B13>0,'User input'!F$35*F12,0))","v":4125},{"$f":"IF(B13>'User input'!F$21,\"\",(IF(E13>'User input'!L$11,(E13-'User input'!L$11)*'User input'!F$34+'User input'!J$11*'User input'!F$19*'User input'!F$32*('User input'!L$11/1000)^'User input'!K$11,'User input'!J$11*'User input'!F$19*'User input'!F$32*(E13/1000)^'User input'!K$11))*'User input'!F$33)","v":688.27903910599809},{"$f":"IF(B13>'User input'!F$21,\"\",IF(B13>0,(P13-P12),0))","v":688.27903910599809},{"$f":"IF(B13>'User input'!F$21,\"\",Q13/'User input'!F$22)","v":2.7531161564239923},{"$f":"IF(B13>'User input'!F$21,\"\",(J13+L13+O13+Q13)*('User input'!L$15+'User input'!L$16)-IF(B13='User input'!F$21,(F13-K13)*'User input'!L$15,0))","v":29444.005000804416},{"$f":"IF(B13>'User input'!F$21,\"\",L13+M13+N13+O13+Q13-S13)","v":-13380.725961698417},{"$f":"IF(B13>'User input'!F$21,\"\",C13*T13)","v":-12961.423898579373}]
[null,{"$f":"IF(B13>='User input'!F$21,\"\",B13+1)","v":2},{"$f":"IF(B14>'User input'!F$21,\"\",'User input'!F$38^B14)","v":0.93830941869200402},{"$f":"IF(B14>'User input'!F$21,\"\",IF(B14=0,'User input'!F$14,D13+1))","v":2},{"$f":"IF(B14>'User input'!F$21,\"\",IF(B14=0,'User input'!F$15,E13+'User input'!F$22))","v":500},{"$f":"IF(B14>'User input'!F$21,\"\",IF(F$57=1,F62,IF(F$57=2,H62,\"Error\")))","v":201074.5585882242},{"$f":"IF(B14>'User input'!F$21,\"\",IF(B14>0,F13*'User input'!L$13,0))","v":11712.890487703798},{"$f":"IF(B14>'User input'!F$21,\"\",IF(B14>0,F13-F14,0))","v":33183.251165851747},{"$f":"IF(B14>'User input'!F$21,\"\",IF(B14>7,0,IF(SUM(I$11:I13)<1,IF(B14='User input'!F$21,'User input'!L24/2,'User input'!L24),0)))","v":0.1749},{"$f":"IF(B14>'User input'!F$21,\"\",IF(B14=0,MIN('User input'!F$16,'User input'!L$17)+'User input'!L$19+'User input'!L$20*I14,'User input'!L$20*I14))","v":48097.5},{"$f":"IF(B14>'User input'!F$21,\"\",IF(B14=0,'User input'!F$16-J14,K13-J14))","v":120257.5},{"$f":"IF(B14>'User input'!F$21,\"\",IF(B14>0,('User input'!F$16-'User input'!F$18)*'User input'!L$13,0))","v":11250},{"$f":"IF(B14>'User input'!F$21,\"\",IF(B14='User input'!F$21,'User input'!F$16-'User input'!F$18,0))","v":0},{"$f":"IF(B14>'User input'!F$21,\"\",IF(B14=0,'User input'!F$18,IF(B14='User input'!F$21,-F14,0)))","v":0},{"$f":"IF(B14>'User input'!F$21,\"\",IF(B14>0,'User input'!F$35*F13,0))","v":3513.8671463111391},{"$f":"IF(B14>'User input'!F$21,\"\",(IF(E14>'User input'!L$11,(E14-'User input'!L$11)*'User input'!F$34+'User input'!J$11*'User input'!F$19*'User input'!F$32*('User input'!L$11/1000)^'User input'!K$11,'User input'!J$11*'User input'!F$19*'User input'!F$32*(E14/1000)^'User input'!K$11))*'User input'!F$33)","v":2950.7168357351529},{"$f":"IF(B14>'User input'!F$21,\"\",IF(B14>0,(P14-P13),0))","v":2262.4377966291549},{"$f":"IF(B14>'User input'!F$21,\"\",Q14/'User input'!F$22)","v":9.0497511865166196},{"$f":"IF(B14>'User input'!F$21,\"\",(J14+L14+O14+Q14)*('User input'!L$15+'User input'!L$16)-IF(B14='User input'!F$21,(F14-K14)*'User input'!L$15,0))","v":22988.703144857922},{"$f":"IF(B14>'User input'!F$21,\"\",L14+M14+N14+O14+Q14-S14)","v":-5962.3982019176292},{"$f":"IF(B14>'User input'!F$21,\"\",C14*T14)","v":-5594.5743908515806}]
[null,{"$f":"IF(B14>='User input'!F$21,\"\",B14+1)","v":3},{"$f":"IF(B15>'User input'!F$21,\"\",'User input'!F$38^B15)","v":0.90890629989054483},{"$f":"IF(B15>'User input'!F$21,\"\",IF(B15=0,'User input'!F$14,D14+1))","v":3},{"$f":"IF(B15>'User input'!F$21,\"\",IF(B15=0,'User input'!F$15,E14+'User input'!F$22))","v":750},{"$f":"IF(B15>'User input'!F$21,\"\",IF(F$57=1,F63,IF(F$57=2,H63,\"Error\")))","v":173908.90895266252},{"$f":"IF(B15>'User input'!F$21,\"\",IF(B15>0,F14*'User input'!L$13,0))","v":10053.72792941121},{"$f":"IF(B15>'User input'!F$21,\"\",IF(B15>0,F14-F15,0))","v":27165.649635561684},{"$f":"IF(B15>'User input'!F$21,\"\",IF(B15>7,0,IF(SUM(I$11:I14)<1,IF(B15='User input'!F$21,'User input'!L25/2,'User input'!L25),0)))","v":0.1249},{"$f":"IF(B15>'User input'!F$21,\"\",IF(B15=0,MIN('User input'!F$16,'User input'!L$17)+'User input'!L$19+'User input'!L$20*I15,'User input'!L$20*I15))","v":34347.5},{"$f":"IF(B15>'User input'!F$21,\"\",IF(B15=0,'User input'!F$16-J15,K14-J15))","v":85910},{"$f":"IF(B15>'User input'!F$21,\"\",IF(B15>0,('User input'!F$16-'User input'!F$18)*'User input'!L$13,0))","v":11250},{"$f":"IF(B15>'User input'!F$21,\"\",IF(B15='User input'!F$21,'User input'!F$16-'User input'!F$18,0))","v":0},{"$f":"IF(B15>'User input'!F$21,\"\",IF(B15=0,'User input'!F$18,IF(B15='User input'!F$21,-F15,0)))","v":0},{"$f":"IF(B15>'User input'!F$21,\"\",IF(B15>0,'User input'!F$35*F14,0))","v":3016.1183788233629},{"$f":"IF(B15>'User input'!F$21,\"\",(IF(E15>'User input'!L$11,(E15-'User input'!L$11)*'User input'!F$34+'User input'!J$11*'User input'!F$19*'User input'!F$32*('User input'!L$11/1000)^'User input'!K$11,'User input'!J$11*'User input'!F$19*'User input'!F$32*(E15/1000)^'User input'!K$11))*'User input'!F$33)","v":6913.8376717319306},{"$f":"IF(B15>'User input'!F$21,\"\",IF(B15>0,(P15-P14),0))","v":3963.1208359967777},{"$f":"IF(B15>'User input'!F$21,\"\",Q15/'User input'!F$22)","v":15.85248334398711},{"$f":"IF(B15>'User input'!F$21,\"\",(J15+L15+O15+Q15)*('User input'!L$15+'User input'!L$16)-IF(B15='User input'!F$21,(F15-K15)*'User input'!L$15,0))","v":18559.588942831509},{"$f":"IF(B15>'User input'!F$21,\"\",L15+M15+N15+O15+Q15-S15)","v":-330.34972801136973},{"$f":"IF(B15>'User input'!F$21,\"\",C15*T15)","v":-300.25694895666192}]
{"$rows_left_out":69}
{"sheet":"Analysis summary","index":3,"n_rows":33,"n_cols":8,"rows_kept":33,"cut":false,"hidden":false,"merged":[]}
[]
[null,"Combine analysis summary section"]
[]
[null,"Analysis highlights:"]
[null,"Combine class used",null,null,null,{"$f":"VLOOKUP('User input'!F13,'User input'!B7:J10,2)","v":"JD 9670STS (spread 8r corn 30' rigid)"}]
[]
[null,"Combine purchase price",null,null,null,{"$f":"'User input'!F16","v":275000}]
[null,"Combine age when purchased",null,null,null,{"$f":"'User input'!F14","v":0}]
[null,"Hours on combine when purchased",null,null,null,{"$f":"'User input'!F15","v":0}]
[null,"Hours used per year",null,null,null,{"$f":"'User input'!F22","v":250}]
[null,"Total acres harvested per year",null,null,null,{"$f":"'User input'!F22*'User input'!F23","v":3000}]
[null,"Number of years combine is used",null,null,null,{"$f":"'User input'!F21","v":5}]
[null,"Combine value when sold",null,null,null,{"$f":"-MIN('Time and Tax (TT)'!N12:N32)","v":133093.3100915094}]
[null,"Accumulated repairs over lifetime",null,null,null,{"$f":"MAX('Time and Tax (TT)'!P12:P32)","v":20211.63993660812}]
[]
{"$rows_left_out":18}