{"text_format":"1","workbook":"xlsx","n_sheets":4,"sheets":["Beef Repl","Prices and weights","Net present value","Sensitivity Table"],"not_rendered":{"charts":5,"images":3,"macros":0,"external_links":1,"defined_names":8,"comments":2,"pivot_tables":0},"unopened":[],"bounds":{"document_bytes":16777216,"sheet_cells":100000,"rows_first":2000,"rows_last":500,"rows_between":2000,"halvings":0,"cell_chars":16384,"cell_head_chars":4096},"cells_cut":0,"cells_raw":0,"read":"whole","date_system":"1900"}

{"sheet":"Beef Repl","index":0,"n_rows":49,"n_cols":12,"rows_kept":49,"cut":false,"hidden":false,"merged":[[48,1,49,11],[30,1,30,4],[32,1,36,11],[46,15,46,16],[4,1,5,8],[4,13,5,23],[7,2,7,3],[7,4,7,5],[7,13,8,13],[28,1,29,11],[40,1,40,4],[40,7,40,11],[46,1,46,3],[46,6,46,8]]}
[]
[]
[null,"KSU-Beef Replacements"]
[]
[null,"An Excel spreadsheet program to evaluate the economic value of purchasing beef replacement females."]
[]
[]
[null,null,null,null,null,null,null,null,null,null,null,"Version- 12.15.2025"]
[]
[]
[]
[]
[]
[]
[]
[]
[]
[]
[]
[]
{"$rows_left_out":30}
{"sheet":"Prices and weights","index":1,"n_rows":20,"n_cols":13,"rows_kept":20,"cut":false,"hidden":false,"merged":[[4,6,4,7],[1,1,1,7],[1,9,1,12],[4,2,4,3],[4,4,4,5]]}
[]
[null,"Calf (average of steer and heifer) and Cull Cow Price Scenarios ($/cwt)",null,null,null,null,null,null,null,"Weaning Weight (steer and heifer) Scenarios"]
[]
[null,null,"Scenario 1 (S1)",null,"Scenario 2 (S2)",null,"Scenario 3 (S3)",null,null,null,"Scenario1","Scenario2","Scenario3"]
[null,null,"USDA (As of Dec. 2025)",null,"Flat at $40 under Scen 1",null,"Scenario 1 +10%",null,null,null,"Low peak","Constant","High peak"]
[null,"Year","Calf","Cull cow","Calf","Cull cow","Calf","Cull cow",null,"Calf","Lbs/hd","Lbs/hd","Lbs/hd"]
[null,2026,464.73172060255627,{"$f":"C7*0.4","v":185.89268824102251},{"$f":"C7-40","v":424.73172060255627},{"$f":"E7*0.4","v":169.89268824102251},{"$f":"C7*1.1","v":511.20489266281191},{"$f":"G7*0.4","v":204.48195706512479},null,1,542,562,537]
[null,{"$f":"B7+1","v":2027},453.14,{"$f":"C8*0.4","v":181.256},{"$f":"E7","v":424.73172060255627},{"$f":"E8*0.4","v":169.89268824102251},{"$f":"C8*1.1","v":498.45400000000001},{"$f":"G8*0.4","v":199.38160000000002},null,2,552,{"$f":"L7","v":562},552]
[null,{"$f":"B8+1","v":2028},450.82,180.328,{"$f":"E8","v":424.73172060255627},169.89268824102251,495.90200000000004,198.36080000000004,null,3,562,{"$f":"L8","v":562},567]
[null,2029,406.43,162.572,424.73172060255627,169.89268824102251,447.07300000000004,178.82920000000001,null,4,567,562,582]
[null,2030,388.28,155.31200000000001,424.73172060255627,169.89268824102251,427.108,170.84320000000002,null,5,572,562,582]
[null,2031,367.75,147.1,424.73172060255627,169.89268824102251,404.52500000000003,161.81000000000003,null,6,572,562,577]
[null,2032,352.16,140.864,424.73172060255627,169.89268824102251,387.37600000000003,154.95040000000003,null,7,567,562,567]
[null,2033,337.35,134.94000000000003,424.73172060255627,169.89268824102251,371.08500000000004,148.43400000000003,null,8,565,562,557]
[null,2034,325.11,130.04400000000001,424.73172060255627,169.89268824102251,357.62100000000004,143.04840000000002,null,9,562,562,552]
[null,2035,313.45999999999998,125.384,424.73172060255627,169.89268824102251,344.80599999999998,137.92240000000001,null,10,559,562,547]
[null,"Average",{"$f":"AVERAGE(C7:C16)","v":385.92317206025564},{"$f":"AVERAGE(D7:D16)","v":154.36926882410228},424.73172060255627,169.89268824102254,424.51548926628118,169.80619570651248,null,"Average",{"$f":"AVERAGE(K7:K16)","v":562},{"$f":"AVERAGE(L7:L16)","v":562},{"$f":"AVERAGE(M7:M16)","v":562}]
[]
[null,"Average weight for calf price (average of steer and heifer), lbs/head",null,null,null,null,null,562]
[null,"Price slide (change in price for weight deviation from base), $/lb",null,null,null,null,null,0.1215]
{"$rows_left_out":1}
{"sheet":"Net present value","index":2,"n_rows":79,"n_cols":45,"rows_kept":79,"cut":false,"hidden":false,"merged":[[25,1,26,14],[11,8,11,9],[11,41,11,42]]}
[]
[null,"Input Assumptions"]
[null,"Number of replacements purchased",null,null,null,null,100,null,"Percent marketable calves (1 - death loss)",null,null,null,null,0.97]
[null,"Year of purchase",null,null,null,null,2026,null,"Annual cow death loss",null,null,null,null,5.0000000000000001E-3]
[null,"First year for calf sales",null,null,null,null,2027,null,"Annual cull rate",null,null,null,null,0.15]
[null,"Cull cow weight, lbs/hd",null,null,null,null,1250]
[null,"Annual cash cow costs, $/year",null,null,null,null,1100,null,"Annual inflation rate on costs",null,null,null,null,0.03]
[null,{"$f":"\"Price scenario to use (1-3) (\"&IF(G8=1,'Prices and weights'!C5,IF(G8=2,'Prices and weights'!E5,'Prices and weights'!G5))&\")\"","v":"Price scenario to use (1-3) (USDA (As of Dec. 2025))"},null,null,null,null,1,null,"Annual increase in average weaning weight",null,null,null,null,1.4999999999999999E-2,null,null,null,null,null,null,null,null,null,null,null,null,null,null,null,null,null,null,null,null,null,"Sensitivity to discount rate",null,null,"Sensitivity to calf/cull prices"]
[null,"Weaning weight scenario to use (1-3)",null,null,null,null,1,null,"Discount rate (interest rate)",null,null,null,null,0.08,null,null,null,"Values for sensitivity analysis down below",null,null,null,null,null,null,null,null,null,null,null,null,null,null,null,null,null,0.9,"<= % of base",null,1.1000000000000001,"<= % of base"]
[]
[null,"Net Present Value Analysis",null,null,null,null,null,null,null,null,null,null,null,null,null,null,null,"Annual cow costs, $/year",null,null,null,null,null,"Annual Cull Rate",null,null,null,null,null,"Annual Cull Rate",null,null,null,null,null,{"$f":"N9*AJ9","v":7.2000000000000008E-2}]
[null,null,"Cows at",null,null,"Prices, $/cwt",null,"Calf","Cull Income",null,null,"Cost","Net","Discount",null,null,null,{"$f":"D33","v":800},{"$f":"E33","v":950},{"$f":"F33","v":1100},{"$f":"G33","v":1250},{"$f":"H33","v":1400},null,{"$f":"Y12-H72","v":0.1},{"$f":"Z12-H72","v":0.125},{"$f":"N5","v":0.15},{"$f":"Z12+H72","v":0.17499999999999999},{"$f":"AA12+H72","v":0.19999999999999998},null,{"$f":"X12","v":0.1},{"$f":"Y12","v":0.125},{"$f":"Z12","v":0.15},{"$f":"AA12","v":0.17499999999999999},{"$f":"AB12","v":0.19999999999999998},null,"Discount",null,null,"Prices, $/cwt",null,"Calf","Cull Income",null,"Net"]
[null,"Year","BOY*","Calf","Calf wt","Calf","Cull","Income","Annual","Age","Cash Cost","Adj.","Income","factor","NPV**",null,null,"Cost","Cost","Cost","Cost","Cost",null,"Cows at Beginning of Year (BOY)",null,null,null,null,null,"Net Income",null,null,null,null,null,"factor","NPV**",null,"Calf","Cull","Income","Annual","Age","Income","NPV**"]
[null,{"$f":"G5","v":2027},{"$f":"G3","v":100},{"$f":"IF(G5=B14,1,0)","v":1},{"$f":"VLOOKUP(D14,weights,IF(G$9=1,2,IF(G$9=2,3,4)))*(1+N$8)^(B14-G$5)","v":542},{"$f":"VLOOKUP(B14,Prices,IF(G$8=1,2,IF(G$8=2,4,6)))+('Prices and weights'!H$19-E14)*'Prices and weights'!H$20","v":455.57},{"$f":"VLOOKUP(B14,Prices,IF(G$8=1,3,IF(G$8=2,5,7)))","v":181.256},{"$f":"IF(B14>=G$5,E14*F14/100*N$3*C14/G$3,0)","v":2395.1137180000001},{"$f":"IF(B14>=G$5,G$6*G14/100*(N$5*C14/G$3),0)","v":339.85499999999996},{"$f":"IF(B14>=G$5,G$6*G14/100*(C14*(1-N$4-N$5))/G$3,0)","v":1914.5165},{"$f":"G$7*(1+N$7)^(B14-G$4)*C14/G$3","v":1133},0,{"$f":"H14+I14-K14-L14","v":1601.9687180000001},{"$f":"1/(1+N$9)^(B14-G$4)","v":0.92592592592592582},{"$f":"SUMPRODUCT(M$14:M14,N$14:N14)+J14*N14","v":3256.0048314814812},null,null,{"$f":"D$33*(1+N$7)^(B14-G$4)*C14/G$3","v":824},{"$f":"E$33*(1+N$7)^(B14-G$4)*C14/G$3","v":978.5},{"$f":"F$33*(1+N$7)^(B14-G$4)*C14/G$3","v":1133},{"$f":"G$33*(1+N$7)^(B14-G$4)*C14/G$3","v":1287.5},{"$f":"H$33*(1+N$7)^(B14-G$4)*C14/G$3","v":1442},null,{"$f":"$G3","v":100},{"$f":"$G3","v":100},{"$f":"$G3","v":100},{"$f":"$G3","v":100},{"$f":"$G3","v":100},null,{"$f":"IF(B14>=G$5,E14*F14/100*N$3*X14/G$3,0)+IF(B14>=G$5,G$6*G14/100*(AD$12*X14/G$3),0)-G$7*(1+N$7)^(B14-G$4)*X14/G$3-L14","v":1488.6837180000002},{"$f":"IF(B14>=G$5,E14*F14/100*N$3*Y14/G$3,0)+IF(B14>=G$5,G$6*G14/100*(AE$12*Y14/G$3),0)-G$7*(1+N$7)^(B14-G$4)*Y14/G$3-L14","v":1545.3262180000002},{"$f":"IF(B14>=G$5,E14*F14/100*N$3*Z14/G$3,0)+IF(B14>=G$5,G$6*G14/100*(AF$12*Z14/G$3),0)-G$7*(1+N$7)^(B14-G$4)*Z14/G$3-L14","v":1601.9687180000001},{"$f":"IF(B14>=G$5,E14*F14/100*N$3*AA14/G$3,0)+IF(B14>=G$5,G$6*G14/100*(AG$12*AA14/G$3),0)-G$7*(1+N$7)^(B14-G$4)*AA14/G$3-L14","v":1658.611218},{"$f":"IF(B14>=G$5,E14*F14/100*N$3*AB14/G$3,0)+IF(B14>=G$5,G$6*G14/100*(AH$12*AB14/G$3),0)-G$7*(1+N$7)^(B14-G$4)*AB14/G$3-L14","v":1715.2537179999999},null,{"$f":"1/(1+AJ$11)^(B14-G$4)","v":0.93283582089552231},{"$f":"SUMPRODUCT(M$14:M14,AJ$14:AJ14)+J14*AJ14","v":3280.3033749999995},null,{"$f":"VLOOKUP(B14,Prices,IF(G$8=1,2,IF(G$8=2,4,6)))*AM$9+('Prices and weights'!H$19-E14)*'Prices and weights'!H$20","v":500.88400000000001},{"$f":"G14*AM$9","v":199.38160000000002},{"$f":"IF(B14>=G$5,E14*AM14/100*N$3*C14/G$3,0)","v":2633.3475416000001},{"$f":"IF(B14>=G$5,G$6*AN14/100*(N$5*C14/G$3),0)","v":373.84050000000008},{"$f":"IF(B14>=G$5,G$6*AN14/100*(C14*(1-N$4-N$5))/G$3,0)","v":2105.9681500000002},{"$f":"AO14+AP14-K14-L14","v":1874.1880416000004},{"$f":"SUMPRODUCT(AR$14:AR14,N$14:N14)+AQ14*N14","v":3685.3298070370374}]
[null,{"$f":"+B14+1","v":2028},{"$f":"C14*(1-N$4-N$5)","v":84.5},{"$f":"IF(D14>0,D14+1,IF(G$5=B15,1,0))","v":2},560.28,{"$f":"VLOOKUP(B15,Prices,IF(G$8=1,2,IF(G$8=2,4,6)))+('Prices and weights'!H$19-E15)*'Prices and weights'!H$20","v":451.02897999999999},{"$f":"VLOOKUP(B15,Prices,IF(G$8=1,3,IF(G$8=2,5,7)))","v":180.328},{"$f":"IF(B15>=G$5,E15*F15/100*N$3*C15/G$3,0)","v":2071.2761798888791},{"$f":"G$6*G15/100*(N$5*C15/G$3)","v":285.70717500000001},{"$f":"IF(B15>=G$5,G$6*G15/100*(C15*(1-N$4-N$5))/G$3,0)","v":1609.4837525},{"$f":"G$7*(1+N$7)^(B15-G$4)*C15/G$3","v":986.10654999999997},0,{"$f":"H15+I15-K15-L15","v":1370.8768048888792},0.85733882030178321,{"$f":"SUMPRODUCT(M$14:M15,N$14:N15)+J15*N15","v":4038.4831728642648},null,null,717.16840000000002,851.63747499999999,986.10654999999997,1120.5756249999999,1255.0446999999999,null,{"$f":"X14*(1-$N$4-X$12)","v":89.5},{"$f":"Y14*(1-$N$4-Y$12)","v":87},{"$f":"Z14*(1-$N$4-Z$12)","v":84.5},{"$f":"AA14*(1-$N$4-AA$12)","v":82},{"$f":"AB14*(1-$N$4-AB$12)","v":79.5},null,1351.1228005923633,1362.4086152406212,1370.8768048888792,1376.5273695371372,1379.3603091853947,null,0.87018266874582295,{"$f":"SUMPRODUCT(M$14:M15,AJ$14:AJ15)+J15*AJ15","v":4087.8319077579208},null,{"$f":"VLOOKUP(B15,Prices,IF(G$8=1,2,IF(G$8=2,4,6)))*AM$9+('Prices and weights'!H$19-E15)*'Prices and weights'!H$20","v":496.11098000000004},198.36080000000001,2278.3078272605203,314.27789250000001,1770.4321277500003,1606.4791697605201,{"$f":"SUMPRODUCT(AR$14:AR15,N$14:N15)+AQ15*N15","v":4630.5164458492118}]
[null,2029,71.402500000000003,{"$f":"IF(D15>0,D15+1,IF(G$5=B16,1,0))","v":3},578.98644999999988,{"$f":"VLOOKUP(B16,Prices,IF(G$8=1,2,IF(G$8=2,4,6)))+('Prices and weights'!H$19-E16)*'Prices and weights'!H$20","v":404.36614632500005},162.572,1621.5425206858213,{"$f":"G$6*G16/100*(N$5*C16/G$3)","v":217.65088556250004},1226.09998866875,858.25783579250015,0,980.93557045582111,0.79383224102016958,{"$f":"SUMPRODUCT(M$14:M16,N$14:N16)+J16*N16","v":4410.626255112089},null,null,624.18751694000002,741.22267636625008,858.25783579250015,975.29299521875009,1092.328154645,null,{"$f":"X15*(1-$N$4-X$12)","v":80.102500000000006},75.69,71.402500000000003,67.240000000000009,63.202500000000001,null,1019.0670006257579,1001.3843689847016,980.93557045582111,957.91111910161635,932.50152898458737,null,0.81173756412856624,{"$f":"SUMPRODUCT(M$14:M16,AJ$14:AJ16)+J16*AJ16","v":4478.8207094133368},null,{"$f":"VLOOKUP(B16,Prices,IF(G$8=1,2,IF(G$8=2,4,6)))*AM$9+('Prices and weights'!H$19-E16)*'Prices and weights'!H$20","v":445.00914632500007},178.82920000000001,1784.5243955712244,239.41597411875006,1348.709987535625,1165.6825338974743,{"$f":"SUMPRODUCT(AR$14:AR16,N$14:N16)+AQ16*N16","v":5108.6621041132421}]
[null,2030,60.335112500000001,4,592.89963862499974,{"$f":"VLOOKUP(B17,Prices,IF(G$8=1,2,IF(G$8=2,4,6)))+('Prices and weights'!H$19-E17)*'Prices and weights'!H$20","v":384.52569390706253},155.31200000000001,1334.2844088377874,175.70188111125003,989.7872635933752,746.9847073820024,0,763.00158256703503,0.73502985279645328,{"$f":"SUMPRODUCT(M$14:M17,N$14:N17)+J17*N17","v":4725.660680968922},null,null,543.26160536872897,645.12315637536562,746.9847073820024,848.84625838863894,950.70780939527572,null,71.691737500000002,65.850300000000004,60.335112500000001,55.136800000000015,50.245987500000005,null,837.02699855222465,800.78654336186094,763.00158256703503,724.02404549133098,684.18766083333185,null,0.75721787698560261,{"$f":"SUMPRODUCT(M$14:M17,AJ$14:AJ17)+J17*AJ17","v":4810.7923401269327},null,{"$f":"VLOOKUP(B17,Prices,IF(G$8=1,2,IF(G$8=2,4,6)))*AM$9+('Prices and weights'!H$19-E17)*'Prices and weights'!H$20","v":423.35369390706256},170.84320000000002,1469.0155746539144,193.27206922237505,1088.7659899527127,915.302936494287,{"$f":"SUMPRODUCT(AR$14:AR17,N$14:N17)+AQ17*N17","v":5511.0631202218374}]
[null,2031,50.983170062500001,5,607.09995095749969,{"$f":"VLOOKUP(B18,Prices,IF(G$8=1,2,IF(G$8=2,4,6)))+('Prices and weights'!H$19-E18)*'Prices and weights'!H$20","v":362.2703559586638},147.1,1087.6560143307258,140.61795592863282,792.1478183979649,650.13814006992573,0,578.13583018943302,0.68058319703375303,{"$f":"SUMPRODUCT(M$14:M18,N$14:N18)+J18*N18","v":4930.7295207087664},null,null,472.8277382326732,561.48293915129955,650.13814006992573,738.7933409885519,827.4485419071782,null,64.164105062499999,57.289761000000006,50.983170062500001,45.212176000000014,39.945560062500007,null,668.61331574561746,623.31553694200113,578.13583018943302,533.4777372308547,489.69716542368019,null,0.7063599598746293,{"$f":"SUMPRODUCT(M$14:M18,AJ$14:AJ18)+J18*AJ18","v":5029.2212327544239},null,{"$f":"VLOOKUP(B18,Prices,IF(G$8=1,2,IF(G$8=2,4,6)))*AM$9+('Prices and weights'!H$19-E18)*'Prices and weights'!H$20","v":399.04535595866383},161.81,1198.066787028828,154.67975152149609,871.3626002377614,702.60839848039848,{"$f":"SUMPRODUCT(AR$14:AR18,N$14:N18)+AQ18*N18","v":5782.005829243124}]
[null,2032,43.080778702812502,6,616.20645022186204,{"$f":"VLOOKUP(B19,Prices,IF(G$8=1,2,IF(G$8=2,4,6)))+('Prices and weights'!H$19-E19)*'Prices and weights'!H$20","v":345.5739162980438},140.864,889.86161569889987,113.78495270986836,640.98856693225855,565.84773020985995,0,437.79883819890824,0.63016962688310452,{"$f":"SUMPRODUCT(M$14:M19,N$14:N19)+J19*N19","v":5071.4260825178662},null,null,411.52562197080721,488.68667609033355,565.84773020985995,643.00878432938623,720.16983844891263,null,57.426874030937498,49.842092070000007,43.080778702812502,37.073984320000015,31.756720249687508,null,533.02922343288753,484.56869355741674,437.79883819890824,393.07609328406335,350.67922762373485,null,0.65891787301737803,{"$f":"SUMPRODUCT(M$14:M19,AJ$14:AJ19)+J19*AJ19","v":5180.5120339630266},null,{"$f":"VLOOKUP(B19,Prices,IF(G$8=1,2,IF(G$8=2,4,6)))*AM$9+('Prices and weights'!H$19-E19)*'Prices and weights'!H$20","v":380.78991629804381},154.95040000000003,980.54371055765978,125.16344798085522,705.08742362548446,539.85942832865499,{"$f":"SUMPRODUCT(AR$14:AR19,N$14:N19)+AQ19*N19","v":5973.4987781829004}]
[null,2033,36.403258003876566,7,619.98233065547674,{"$f":"VLOOKUP(B20,Prices,IF(G$8=1,2,IF(G$8=2,4,6)))+('Prices and weights'!H$19-E20)*'Prices and weights'!H$20","v":330.3051468253596},134.94000000000003,723.1137859149685,92.104793157058211,518.85700145142789,492.48557198815166,0,322.73300708387507,0.58349039526213387,{"$f":"SUMPRODUCT(M$14:M20,N$14:N20)+J20*N20","v":5158.5542431867561},null,null,358.17132508229207,425.32844853522181,492.48557198815166,559.6426954410814,626.79981889401108,null,51.397052257689062,43.362620100900003,36.403258003876566,30.400667142400014,25.246592598501572,null,412.31346948159728,366.14574221871862,322.73300708387507,282.3366317824109,245.11595848703632,null,0.6146621949788974,{"$f":"SUMPRODUCT(M$14:M20,AJ$14:AJ20)+J20*AJ20","v":5275.4467727301835},null,{"$f":"VLOOKUP(B20,Prices,IF(G$8=1,2,IF(G$8=2,4,6)))*AM$9+('Prices and weights'!H$19-E20)*'Prices and weights'!H$20","v":364.04014682535961},148.43400000000005,796.96744457666443,101.31527247276406,570.74270159657078,405.79714506127681,{"$f":"SUMPRODUCT(AR$14:AR20,N$14:N20)+AQ20*N20","v":6098.9757206324703}]
{"$rows_left_out":60}
{"sheet":"Sensitivity Table","index":3,"n_rows":35,"n_cols":14,"rows_kept":35,"cut":false,"hidden":true,"merged":[[4,1,4,6],[34,1,35,6],[31,1,32,6]]}
[]
[null,"Sensitivity of results in \"Net present value\" tab"]
[null,"Range NPV values are pulled from",null,"O14:O23","E35:E44","AK14:AK23","AS14:AS23"]
[]
[null,"Table 1. Net Present Value of Beef Replacements, Sensitivity Analysis Summary*",null,null,null,null,null,null,"Marginal Impacts (relative to Base Case):"]
[null,null,"Number",null,"10% Lower","10% Lower","10% Higher",null,"Costs","Discount","Prices","Costs","Discount","Prices"]
[null,"Year","of Calves","Base Case","Cow Costs/yr","Discount Rate","Calf Prices",null,"$/head","$/head","$/head","%","%","%"]
[null,{"$f":"'Net present value'!B14","v":2027},{"$f":"'Net present value'!D14","v":1},{"$f":"'Net present value'!O14","v":3256.0048314814812},{"$f":"'Net present value'!E35","v":3399.0603870370369},{"$f":"'Net present value'!AK14","v":3280.3033749999995},{"$f":"'Net present value'!AS14","v":3685.3298070370374},null,{"$f":"E8-$D8","v":143.05555555555566},{"$f":"F8-$D8","v":24.298543518518272},{"$f":"G8-$D8","v":429.32497555555619},{"$f":"I8/$D8","v":4.3935916240783163E-2},{"$f":"J8/$D8","v":7.4626865671641044E-3},{"$f":"K8/$D8","v":0.13185636931632361}]
[null,{"$f":"'Net present value'!B15","v":2028},{"$f":"'Net present value'!D15","v":2},{"$f":"'Net present value'!O15","v":4038.4831728642648},{"$f":"'Net present value'!E36","v":4296.8242865473921},{"$f":"'Net present value'!AK15","v":4087.8319077579208},{"$f":"'Net present value'!AS15","v":4630.5164458492118},null,258.34111368312733,49.348734893656001,592.03327298494696,6.3969837838868795E-2,1.2219621273958601E-2,0.14659792987698689]
[null,{"$f":"'Net present value'!B16","v":2029},{"$f":"'Net present value'!D16","v":3},{"$f":"'Net present value'!O16","v":4410.626255112089},{"$f":"'Net present value'!E37","v":4761.8736516807094},{"$f":"'Net present value'!AK16","v":4478.8207094133368},{"$f":"'Net present value'!AS16","v":5108.6621041132421},null,351.24739656862039,68.194454301247788,698.03584900115311,7.9636626694794391E-2,1.5461399437825351E-2,0.15826229850967358]
[null,{"$f":"'Net present value'!B17","v":2030},{"$f":"'Net present value'!D17","v":4},{"$f":"'Net present value'!O17","v":4725.660680968922},{"$f":"'Net present value'!E38","v":5151.7793583795692},{"$f":"'Net present value'!AK17","v":4810.7923401269327},{"$f":"'Net present value'!AS17","v":5511.0631202218374},null,426.11867741064725,85.131659158010734,785.40243925291543,9.0171238727889014E-2,1.8014763417282816E-2,0.16619949934532352]
[null,{"$f":"'Net present value'!B18","v":2031},{"$f":"'Net present value'!D18","v":5},{"$f":"'Net present value'!O18","v":4930.7295207087664},{"$f":"'Net present value'!E39","v":5417.1854381942831},{"$f":"'Net present value'!AK18","v":5029.2212327544239},{"$f":"'Net present value'!AS18","v":5782.005829243124},null,486.45591748551669,98.49171204565755,851.27630853435767,9.8658000898737441E-2,1.9975079069334122E-2,0.17264713161795806]
[null,{"$f":"'Net present value'!B19","v":2032},{"$f":"'Net present value'!D19","v":6},{"$f":"'Net present value'!O19","v":5071.4260825178662},{"$f":"'Net present value'!E40","v":5606.5065526877916},{"$f":"'Net present value'!AK19","v":5180.5120339630266},{"$f":"'Net present value'!AS19","v":5973.4987781829004},null,535.08047016992532,109.08595144516039,902.07269566503419,0.10550887688463914,2.1509916475209927E-2,0.17787357658127836]
[null,{"$f":"'Net present value'!B20","v":2033},{"$f":"'Net present value'!D20","v":7},{"$f":"'Net present value'!O20","v":5158.5542431867561},{"$f":"'Net present value'!E41","v":5732.820249864898},{"$f":"'Net present value'!AK20","v":5275.4467727301835},{"$f":"'Net present value'!AS20","v":6098.9757206324703},null,574.26600667814182,116.89252954342737,940.42147744571412,0.1113230528566435,2.2659939981791423E-2,0.1823033030403414]
[null,{"$f":"'Net present value'!B21","v":2034},{"$f":"'Net present value'!D21","v":8},{"$f":"'Net present value'!O21","v":5213.6773465952392},{"$f":"'Net present value'!E42","v":5819.5221789214638},{"$f":"'Net present value'!AK21","v":5336.3280731438672},{"$f":"'Net present value'!AS21","v":6183.5680296664841},null,605.8448323262246,122.65072654862797,969.89068307124489,0.11620297767790866,2.3524801861535275E-2,0.18602813687821057]
[null,{"$f":"'Net present value'!B22","v":2035},{"$f":"'Net present value'!D22","v":9},{"$f":"'Net present value'!O22","v":5244.9523594627872},{"$f":"'Net present value'!E43","v":5876.2459241064244},{"$f":"'Net present value'!AK22","v":5371.5754228033056},{"$f":"'Net present value'!AS22","v":6237.3226375167978},null,631.29356464363718,126.62306334051846,992.37027805401067,0.12036211606472956,2.4141890080673255E-2,0.18920482209215986]
[null,{"$f":"'Net present value'!B23","v":2036},{"$f":"'Net present value'!D23","v":10},{"$f":"'Net present value'!O23","v":5272.8017455652016},{"$f":"'Net present value'!E44","v":5924.6039251833408},{"$f":"'Net present value'!AK23","v":5402.9483792930259},{"$f":"'Net present value'!AS23","v":6283.5878903396888},null,651.80217961813923,130.14663372782434,1010.7861447744872,0.12361590878442393,2.468263363728531E-2,0.19169811298606659]
[]
[null,"Key Inputs Varied Across Scenarios**:"]
[null,"Annual cow costs, $/year",null,{"$f":"'Net present value'!G7","v":1100},{"$f":"'Net present value'!E33","v":950},{"$f":"D20","v":1100},{"$f":"D20","v":1100}]
{"$rows_left_out":15}